program: Gaussian 09
title: 000118774
version: EM64L-G09RevD.01
frameworkgroup: C1[X(C14H26O2)]
method: RPBEPBE
basis: SDD
operation: Freq
keyword: #pfreq=noraman
keyword: PBEPBE/SDD
title: #p freq=noraman PBEPBE/SDD
converged: YES YES NO NO
title: Mulliken charges:
elementType: O O C C C C C C C C C C C C C C H H H H H H H H H H H H H H H H H H H H H H H H H H
charge: -0.256793 -0.250834 -0.383009 -0.384805 -0.380466 -0.374059 -0.380649 -0.379941 -0.393672 -0.454404 -0.282166 -0.156657 -0.190658 0.286034 -0.733186 -0.751810 0.194717 0.193819 0.195937 0.192817 0.195297 0.196484 0.190016 0.195180 0.195304 0.195677 0.210697 0.194150 0.212645 0.212482 0.203554 0.195114 0.228203 0.227404 0.220708 0.216357 0.220366 0.220656 0.221332 0.246780 0.244491 0.246886
chargesum: 0.00000
title: Mulliken charges with hydrogens summed into heavy atoms:
elementType: O O C C C C C C C C C C C C C C
charge: -0.256793 -0.250834 0.005527 0.003950 0.011315 0.011137 0.010332 0.024906 0.031455 -0.055736 0.173441 0.064051 0.025698 0.286034 -0.070832 -0.013652
polarizability: 2.30609498e+02 5.01636929e+00 1.35907837e+02 9.21756019e+00 -2.08635184e+00 1.24394181e+02
1716.lowfreq: -29.9446 -13.9017 -2.7611 -0.0014 0.0013 0.0015 6.5470 16.4023 20.8929
frequency: -29.9354 6.8497 20.4228 25.8285 32.3431 51.4278 64.2078 70.6809 87.1502 109.1058 112.5564 128.6491 143.1174 146.2360 152.8756 181.6116 190.0333 195.9165 247.7944 276.4006 291.5669 339.9779 395.5527 428.4699 468.9331 493.0899 528.9684 566.6282 614.1352 720.6240 726.0366 738.8238 756.4238 775.3407 814.1326 831.9873 868.9599 906.1201 934.4595 945.6153 973.2149 984.3098 993.4860 1002.7030 1007.0905 1029.3372 1040.6540 1041.4719 1043.6641 1056.9614 1071.6683 1078.8191 1080.4746 1092.1070 1108.4841 1149.9389 1159.4050 1197.9996 1203.8636 1207.1410 1228.2495 1237.5197 1255.7755 1267.4663 1272.7010 1281.0650 1283.0974 1289.6115 1295.8625 1295.9678 1299.4582 1312.5315 1332.6566 1346.3414 1354.4258 1357.5517 1371.2251 1382.6344 1392.8280 1453.4147 1454.9190 1456.7224 1460.6813 1461.6499 1462.2274 1465.1071 1467.9076 1472.0892 1472.8902 1478.8409 1485.2577 1489.9190 1649.2349 1690.1467 2948.3411 2950.9525 2951.6048 2954.6422 2957.9821 2963.3332 2964.4369 2968.1582 2984.9623 2989.7100 2991.0038 2999.3675 2999.4954 3007.6305 3007.8331 3019.0638 3033.0865 3036.8680 3042.5800 3046.7292 3062.3747 3067.6779 3074.0082 3087.6544 3095.6551 3142.8555
redmass: 1.0414 4.5568 3.6840 3.1016 3.4173 3.4759 2.7547 1.9613 2.5665 2.0467 2.3956 2.1425 3.6793 2.2690 2.0155 3.3177 2.7767 1.3419 3.8126 2.3847 3.6697 3.3432 3.5597 3.0572 3.3515 3.0270 2.6535 2.9923 4.8689 1.0615 1.0787 1.1192 1.2546 1.2744 1.2747 6.1898 1.3732 1.5636 5.1227 1.2467 1.0791 5.0075 2.9754 1.9831 1.4618 4.0254 1.8635 1.6754 1.5340 1.8862 2.8937 2.4117 2.1209 2.8837 3.5888 1.4676 1.9271 1.5558 1.2611 3.4407 1.3723 1.2945 1.2744 1.2785 1.1211 1.1067 1.0969 1.2220 1.1061 1.1767 1.1927 1.3074 1.4035 1.5003 1.6228 1.6261 1.4761 1.3140 1.2403 1.0635 1.0472 1.0823 1.0748 1.0504 1.0663 1.0769 1.0777 1.0925 1.0574 1.0961 1.0985 1.0988 9.1946 6.2322 1.0614 1.0591 1.0589 1.0591 1.0595 1.0366 1.0595 1.0596 1.0963 1.0598 1.0978 1.0621 1.0933 1.0367 1.0992 1.1032 1.1040 1.0971 1.1039 1.1045 1.0932 1.0923 1.1078 1.0942 1.0974 1.1009
irintensity: 0.9476 0.8818 0.1244 0.0624 0.3401 0.2371 0.2927 0.4736 0.2347 0.3963 0.3183 0.3307 0.7745 0.4739 0.5188 2.4150 6.7340 1.5792 3.7566 2.1833 2.5190 6.5708 1.9321 0.8968 3.0920 1.8572 0.0587 2.6766 4.7517 14.4202 0.8268 3.8630 0.6363 0.1864 0.6263 18.0845 0.1033 7.1027 31.8473 4.5994 58.8915 1.0603 0.5767 117.7777 9.2866 0.5728 2.6360 8.2680 0.3562 10.6008 13.9156 0.9081 1.2425 5.2672 8.0933 1.3753 1.4117 0.6322 50.8218 357.5016 0.3182 3.5715 0.1527 1.8623 0.0872 1.2293 0.2562 2.8717 0.3117 0.4929 0.3562 0.2447 0.7284 0.3172 0.0990 0.2277 13.1053 42.4781 10.0993 28.6576 17.9339 2.4763 0.0757 12.9652 0.8705 0.5339 0.1904 0.5742 15.8166 3.6055 3.6768 30.7979 203.1324 0.2489 14.4470 9.0879 0.2248 3.4664 0.6852 45.0512 11.6653 192.4922 1.1213 15.6566 1.1214 33.4815 14.5673 4.6051 1.8538 2.2116 6.7322 29.5874 63.0810 133.2525 20.8558 17.9059 87.5819 75.8473 9.4632 11.8893
temp: 298.150 k
press: 1.00000 atm
elementType: 8 8 6 6 6 6 6 6 6 6 6 6 6 6 6 6 1 1 1 1 1 1 1 1 1 1 1 1 1 1 1 1 1 1 1 1 1 1 1 1 1 1
symmnumber: 1
zpe: 972192.1 jmol-1
zpe.correction: 0.370288 hartree
zpe.thermalcorrener: 0.390724 hartree
zpe.thermalcorrenthalpy: 0.391668 hartree
zpe.thermalcorrgfe: 0.315728 hartree
zpe.sumelectzpe: -698.217913 hartree
zpe.sumelectthermal: -698.197478 hartree
zpe.sumelectthermalent: -698.196533 hartree
zpe.sumelectthermalfe: -698.272473 hartree
dipole: -1.4683 -1.7022 0.1435
dipole: 2.2526
quadrupole: -111.5691 -104.9376 -97.4155
quadrupole: -14.4679 2.8165 -0.3367
quadrupole: -6.9284 -0.2968 7.2252 -14.4679 2.8165 -0.3367
hfenergy: -698.5882017 hartree
pointgroup: C01 [X(C14H26O2)]
dipole: -0.5786407 0.6675007 -0.0708436 debye
polarizability: 230.6157033|-5.0870037|135.7969266|-9.1489642|-2.3463348|124.4988858 unknown
InChI: InChI=1S/C14H26O2/c1-3-4-5-6-7-8-9-10-11-12-13-16-14(2)15/h3-4H,5-13H2,1-2H3
charge 0 multiplicity 1
42 atoms
O  5.812547 0.601433 -0.007206
O  7.296768 -1.182952 0.211202
C  -0.447321 -0.546585 -0.024894
C  -1.766822 0.252134 -0.120781
C  0.811426 0.348965 -0.05691
C  -3.026154 -0.64293 -0.095833
C  2.13016 -0.451382 0.03427
C  -4.343989 0.155241 -0.211447
C  3.383698 0.453566 -0.017984
C  -5.604259 -0.751054 -0.183467
C  4.672645 -0.361376 0.083078
C  -6.892294 0.020876 -0.381645
C  -7.923677 0.068497 0.502122
C  7.093983 0.044573 0.069897
C  -9.206383 0.846735 0.306439
C  8.147796 1.125777 -0.043364
H  -0.448399 -1.145868 0.909611
H  -0.399666 -1.275421 -0.860983
H  -1.817399 0.979699 0.716054
H  -1.763775 0.853057 -1.054335
H  0.810809 0.948533 -0.991017
H  0.765585 1.076759 0.779779
H  -2.970146 -1.377851 -0.926449
H  -3.036954 -1.236091 0.842553
H  2.168397 -1.186886 -0.796078
H  2.134709 -1.04172 0.974165
H  -4.410228 0.892734 0.613493
H  -4.336992 0.741246 -1.154095
H  3.352029 1.189688 0.808207
H  3.391481 1.030467 -0.962832
H  -5.641807 -1.303759 0.776243
H  -5.49874 -1.513739 -0.98502
H  4.749904 -0.907948 1.041466
H  4.769476 -1.096117 -0.738092
H  -6.972852 0.591328 -1.321999
H  -7.836816 -0.50023 1.441887
H  -9.351761 1.591019 1.11408
H  -10.089208 0.177878 0.327316
H  -9.208069 1.384565 -0.658371
H  8.042137 1.659453 -1.003779
H  9.148666 0.676095 0.024028
H  8.017492 1.870392 0.760891
