program: Gaussian 09
title: 000118741
version: EM64L-G09RevD.01
frameworkgroup: C1[X(C22H30N4O)]
method: RPBEPBE
basis: SDD
operation: Freq
keyword: #p
keyword: freq=noraman
keyword: PBEPBE/SDD
title: #p freq=noraman PBEPBE/SDD
converged: YES YES NO NO
title: Mulliken charges:
elementType: O N N N N C C C C C C C C C C C C C C C C C C C C C C H H H H H H H H H H H H H H H H H H H H H H H H H H H H H H
charge: -0.297325 -0.355481 -0.152905 -0.150233 -0.144385 -0.330192 -0.028645 0.317471 0.328441 -0.364313 -0.340781 0.401353 0.400857 -0.409247 -0.399207 -0.374727 -0.378733 -0.370817 -0.355468 -0.390680 -0.374128 -0.693989 0.097456 -0.646229 -0.645425 -0.646804 -0.646053 0.176539 0.219050 0.245630 0.204059 0.188319 0.202518 0.257483 0.265419 0.305579 0.257511 0.234748 0.235061 0.239154 0.235411 0.298899 0.213101 0.213863 0.207844 0.233346 0.216615 0.234047 0.237921 0.235877 0.215015 0.235797 0.216743 0.235504 0.234651 0.216193 0.238294
chargesum: 0.00000
title: Mulliken charges with hydrogens summed into heavy atoms:
elementType: O N N N N C C C C C C C C C C C C C C C C C C C C C C
charge: -0.297325 -0.056582 -0.152905 -0.150233 -0.144385 0.065397 -0.028645 0.317471 0.328441 0.085376 0.050056 0.401353 0.400857 -0.151764 -0.133788 -0.069149 -0.121222 -0.136069 -0.120407 -0.151526 -0.138718 -0.059182 0.097456 0.037779 0.043388 0.041239 0.043085
polarizability: 4.47511900e+02 3.29202819e+01 3.23415357e+02 2.54757393e+01 -7.50199933e+00 1.89189577e+02
1716.lowfreq: -11.4469 -0.0006 0.0005 0.0007 1.1025 3.1098 10.8528 15.7053 30.8280
frequency: 10.5243 15.6431 30.3956 32.4918 42.4713 44.1365 51.1543 62.8750 77.8132 79.2961 94.7273 98.9837 106.5837 107.8985 124.9500 129.5530 143.5890 178.6518 183.9920 197.8856 201.9366 209.7088 212.6023 228.3422 239.6137 265.2988 283.8656 285.0375 316.7915 322.8607 351.6033 402.4523 414.2360 419.8514 425.0899 433.2912 463.4286 470.1859 489.2017 506.8387 524.6893 532.6520 559.2545 573.8274 596.8736 626.2557 633.5323 666.6790 671.8672 718.4772 730.7223 737.5883 747.7098 757.9578 766.6619 791.1041 807.6910 813.6025 827.4032 832.2163 880.6124 899.5767 918.4781 941.3840 943.8625 953.2195 955.4063 966.6841 976.3961 983.5339 995.6138 1001.8997 1005.5490 1052.9761 1056.1438 1071.4482 1085.3031 1108.6589 1108.7713 1110.8577 1111.0450 1113.8159 1131.9665 1138.9853 1146.7535 1160.5310 1165.7449 1173.0335 1201.2942 1215.4674 1221.4668 1237.1870 1260.4125 1261.0189 1267.4220 1285.8539 1298.0461 1302.6400 1317.5042 1334.6019 1342.8353 1362.2286 1362.7089 1363.3032 1368.6446 1377.4395 1388.8494 1425.4856 1428.0429 1440.8336 1443.5940 1449.4424 1456.5561 1459.2079 1463.2971 1464.4591 1467.2693 1474.4197 1474.6841 1475.8960 1477.8742 1479.3490 1487.9299 1492.9944 1493.2745 1505.0095 1505.3922 1525.1035 1528.9489 1542.6132 1549.2672 1565.0914 1574.0399 1623.6875 1634.3353 2938.5640 2941.0259 2947.6963 2948.9829 2963.4579 2970.1868 2972.4554 2978.8915 3003.4534 3007.7052 3008.3523 3009.9312 3011.0488 3036.5215 3065.5133 3070.4880 3072.1981 3091.9299 3095.6835 3103.3443 3105.7474 3131.1102 3142.2968 3144.8267 3145.3595 3161.6999 3164.7564 3166.5235 3169.4467 3561.6859
redmass: 4.0921 3.8305 3.5526 4.0384 3.0889 4.1614 2.9777 2.6170 2.5289 2.4858 3.1841 2.5688 2.2837 2.0301 2.1778 2.4995 2.6940 3.0030 3.2640 1.3948 1.3387 2.4074 2.4504 2.6421 1.1401 3.3091 4.0556 3.1941 4.5996 4.1698 4.7484 3.3433 3.0557 3.0103 3.1555 3.1551 3.8305 3.6444 3.5496 2.9656 1.6054 2.1771 3.4439 3.5169 4.7058 6.5587 7.0977 3.8055 3.8996 6.5031 1.7472 1.7130 5.2273 4.4578 4.5040 1.4830 1.3050 1.2895 1.6983 1.8295 2.4992 1.7621 4.7608 2.9722 2.9221 1.5613 1.4539 1.3384 1.3600 1.3615 3.1107 2.6523 4.0561 1.4893 1.4977 2.5939 3.7978 1.2372 1.2410 1.3187 1.3236 2.3683 1.4417 1.5292 1.7488 2.0822 1.7101 1.8936 1.2058 1.4114 1.3163 2.1082 2.9025 2.8791 1.3130 1.1169 1.2307 2.1001 1.4931 1.5657 1.4711 3.1755 2.9156 1.4660 4.5810 4.9031 1.2170 1.4003 1.4085 2.2368 2.3296 1.1577 1.2117 1.2317 1.0405 1.0402 1.0848 1.0465 1.2717 1.0460 1.0454 1.3448 1.0979 1.0922 1.0928 1.1779 1.1266 2.4086 2.6347 6.2419 6.7745 5.9589 9.5093 5.8394 6.4621 1.0368 1.0369 1.0390 1.0394 1.0587 1.0606 1.0377 1.0664 1.1001 1.0993 1.0967 1.1018 1.1026 1.0990 1.1002 1.0998 1.1008 1.0967 1.0963 1.0943 1.0943 1.0881 1.0872 1.0871 1.0896 1.0939 1.0943 1.0952 1.0954 1.0772
irintensity: 0.5821 0.8847 1.0660 1.0563 1.3687 2.9707 1.3188 1.9020 3.0554 0.6475 0.9616 2.1602 0.8214 6.3503 2.6466 0.9357 2.4287 2.0343 0.4602 0.5357 0.0813 1.7638 0.4572 3.6540 1.3847 1.2891 1.5281 14.2044 0.9965 2.6187 2.3414 0.6930 3.2848 1.9443 0.2140 0.3070 7.4024 2.5019 5.9004 19.7154 81.1641 7.4291 38.0965 15.2201 15.0560 4.6696 0.6934 12.7573 27.3915 0.9447 8.3717 9.3438 9.2659 23.3894 15.2655 4.8396 16.9582 0.3844 36.1358 83.5695 3.8588 10.8902 76.9958 9.8399 21.6127 12.3048 1.9839 0.5283 7.4684 10.4442 1.4727 1.2027 11.0703 24.3055 23.8212 6.7643 69.6650 0.2027 0.2705 0.8780 1.9720 7.0106 7.8168 2.9828 20.7651 51.3135 33.3410 177.6942 164.3604 75.5262 12.1580 345.7104 24.4971 25.3093 25.8261 23.0690 126.0517 117.3153 47.0605 122.7544 3.4497 362.6353 67.4911 8.3219 37.2404 0.3084 10.4098 4.5496 15.1816 2.8979 17.3166 44.2577 13.5078 5.1005 0.1684 0.1341 5.7874 26.9578 151.9572 22.1792 9.5909 214.7579 55.6016 2.4332 4.5471 11.9299 88.1372 185.8885 169.8612 73.9803 133.9590 173.5373 606.2586 676.1755 36.6339 101.7693 100.0594 172.8131 95.3546 13.4658 19.8214 42.0209 107.3385 27.3666 10.5290 6.9190 58.9564 75.7177 25.8293 1.5088 69.9001 86.3813 4.2928 4.2586 51.7639 51.2781 12.5917 6.2927 3.3794 8.4192 15.7106 21.8652 27.0067 14.6804 17.2039
temp: 298.150 k
press: 1.00000 atm
elementType: 8 7 7 7 7 6 6 6 6 6 6 6 6 6 6 6 6 6 6 6 6 6 6 6 6 6 6 1 1 1 1 1 1 1 1 1 1 1 1 1 1 1 1 1 1 1 1 1 1 1 1 1 1 1 1 1 1
symmnumber: 1
zpe: 1259899.6 jmol-1
zpe.correction: 0.479870 hartree
zpe.thermalcorrener: 0.509138 hartree
zpe.thermalcorrenthalpy: 0.510083 hartree
zpe.thermalcorrgfe: 0.415634 hartree
zpe.sumelectzpe: -1148.550078 hartree
zpe.sumelectthermal: -1148.520810 hartree
zpe.sumelectthermalent: -1148.519866 hartree
zpe.sumelectthermalfe: -1148.614314 hartree
dipole: -2.8720 4.2805 -4.6010
dipole: 6.9094
quadrupole: -110.8819 -135.8192 -170.2453
quadrupole: 12.7628 0.5433 8.8302
quadrupole: 28.1002 3.1629 -31.2632 12.7628 0.5433 8.8302
hfenergy: -1149.0299483 hartree
pointgroup: C01 [X(C22H30N4O1)]
dipole: -0.9384671 -1.7124886 1.8910962 debye
polarizability: 447.984108|-26.3903907|319.5752055|-36.9847486|-10.2480739|192.5575212 unknown
InChI: InChI=1S/C22H30N4O/c1-6-7-16-23-22(27)24-21(17-8-12-19(13-9-17)25(2)3)18-10-14-20(15-11-18)26(4)5/h8-15,23H,6-7,16H2,1-5H3
charge 0 multiplicity 1
57 atoms
O  1.701613 1.81896 -2.151249
N  1.723671 2.847636 -0.05278
N  2.999464 -4.197707 0.075143
N  -6.196465 -0.166369 0.675511
N  -0.136911 1.580923 -0.654152
C  4.177459 2.749671 0.514847
C  -0.539103 0.355537 -0.35864
C  0.360692 -0.836599 -0.276331
C  -1.989054 0.189623 -0.054083
C  3.036657 3.477105 -0.236256
C  5.548606 3.428405 0.296071
C  2.137525 -3.103678 -0.039044
C  -4.82532 -0.051309 0.435845
C  0.255703 -1.752577 0.809275
C  -2.783147 1.322185 0.281414
C  1.376055 -1.084015 -1.244707
C  -2.652212 -1.065337 -0.149791
C  1.121974 -2.850306 0.939557
C  -4.157729 1.215771 0.527223
C  2.233392 -2.190575 -1.138549
C  -4.031791 -1.190555 0.084204
C  6.695163 2.71335 1.043242
C  1.152559 2.023975 -1.017421
C  2.875445 -5.118896 1.211106
C  4.046374 -4.416122 -0.931093
C  -6.854433 -1.474805 0.570585
C  -6.992948 1.026459 0.992597
H  3.94939 2.717624 1.600619
H  4.215413 1.699444 0.165679
H  3.240851 3.466721 -1.321908
H  2.984122 4.535454 0.090317
H  5.493725 4.486069 0.627613
H  5.772378 3.453423 -0.789707
H  -0.503257 -1.584165 1.581835
H  -2.286057 2.296387 0.331171
H  1.483914 -0.39931 -2.091936
H  -2.083566 -1.953756 -0.443534
H  1.011483 -3.507235 1.807041
H  -4.719204 2.116978 0.789288
H  2.98225 -2.342303 -1.920991
H  -4.495523 -2.175166 -0.022231
H  1.202507 2.996994 0.81185
H  6.787452 1.662564 0.710016
H  7.666664 3.211328 0.867603
H  6.511872 2.703362 2.134487
H  3.045348 -4.60645 2.180593
H  3.624724 -5.920555 1.116218
H  1.873432 -5.592911 1.248521
H  4.742245 -3.555097 -0.993678
H  3.61943 -4.582054 -1.941121
H  4.634145 -5.307756 -0.661451
H  -6.782585 -1.894195 -0.454114
H  -7.922075 -1.369823 0.819844
H  -6.41266 -2.211417 1.271602
H  -6.645852 1.516428 1.92475
H  -8.045743 0.73631 1.135247
H  -6.953866 1.777357 0.177455
