program: Gaussian 09
title: 000118586
version: EM64L-G09RevD.01
frameworkgroup: C1[X(C16H14O5)]
method: RPBEPBE
basis: SDD
operation: Freq
keyword: #pfreq=noraman
keyword: PBEPBE/SDD
title: #p freq=noraman PBEPBE/SDD
converged: YES YES NO NO
title: Mulliken charges:
elementType: O O O O O C C C C C C C C C C C C C C C C H H H H H H H H H H H H H H
charge: -0.288329 -0.404544 -0.438849 -0.372770 -0.422326 0.553414 0.153767 -0.505300 0.220648 -0.290893 -0.411656 0.196715 0.191536 0.179003 -0.310196 -0.311481 -0.375358 -0.544248 -0.406360 0.338312 -0.519652 0.253717 0.278798 0.242939 0.216655 0.222802 0.221226 0.250997 0.255221 0.384910 0.366974 0.263511 0.214085 0.233955 0.362773
chargesum: 0.00000
title: Mulliken charges with hydrogens summed into heavy atoms:
elementType: O O O O O C C C C C C C C C C C C C C C C
charge: -0.288329 -0.019634 -0.071875 -0.372770 -0.059552 0.553414 0.153767 -0.251583 0.220648 -0.012095 -0.168717 0.196715 0.191536 0.179003 -0.093541 -0.088679 -0.154132 -0.293250 -0.151138 0.338312 0.191899
polarizability: 4.70751413e+02 -2.41464543e+01 2.20550609e+02 -1.91053068e+00 -2.86130582e+00 8.11345685e+01
1716.lowfreq: -0.0006 -0.0001 0.0007 3.0597 5.5056 8.3361 21.6557 33.2789 40.4861
frequency: 21.5479 33.2768 40.4855 55.4831 76.0396 119.9409 123.1208 140.0789 151.7499 181.5097 188.1969 227.2269 235.0905 267.4225 298.4868 310.3231 328.2114 363.7853 364.9259 390.2968 391.2963 417.4216 423.3521 442.8370 455.6371 480.9415 511.3033 527.8033 572.1622 582.1196 605.2395 610.3553 631.2109 672.3731 705.6409 723.4508 732.0164 745.1702 760.7725 798.0822 808.1910 835.4461 839.2186 873.3418 893.9441 909.6346 927.6428 942.7982 954.7179 1000.7472 1008.7620 1021.9348 1028.9128 1081.5850 1113.2576 1132.2271 1134.9750 1152.7823 1165.0409 1172.1475 1184.9181 1219.5908 1225.1309 1252.8379 1264.1594 1282.1363 1297.4353 1316.7613 1333.7640 1368.3927 1400.7198 1412.3623 1416.4327 1428.5893 1444.2827 1457.7259 1479.3777 1490.7235 1498.1224 1548.9998 1582.1177 1591.7895 1609.0409 1630.1081 1642.0835 2455.5120 2980.6327 3091.1270 3104.1225 3112.8940 3133.0794 3147.4260 3149.5045 3150.6643 3161.1130 3165.2713 3184.4769 3575.2099 3575.9279
redmass: 5.3934 4.8415 6.1065 2.2830 4.6556 8.6735 1.8976 5.0380 2.6793 3.8610 4.4587 5.2283 3.6174 5.5425 4.8637 5.9028 4.2503 1.1413 4.7026 8.9099 4.0960 1.1259 6.6527 2.7727 3.0821 5.0879 5.9090 7.2575 5.3699 4.4207 7.1810 4.8292 4.2155 3.5827 6.2755 3.1735 7.6671 2.5029 6.2675 1.4316 1.7421 5.8175 1.8074 1.8518 1.6509 5.2301 1.3480 1.3587 3.2234 3.1942 1.2336 4.5396 1.0642 2.2514 1.2392 1.5760 1.5529 1.3576 1.2076 2.1647 1.6185 1.5216 1.8340 1.9058 3.4928 1.5066 2.1460 2.0139 1.9508 3.2163 5.3983 7.7453 2.0665 2.9817 1.6061 1.0745 1.0591 3.5431 3.0515 3.1263 6.1738 3.5680 6.3581 5.5109 4.4070 1.0768 1.0346 1.0975 1.0894 1.0889 1.1049 1.0922 1.0909 1.0944 1.0889 1.0899 1.0965 1.0660 1.0659
irintensity: 2.2038 0.9094 0.2690 5.6315 0.9487 0.0074 2.3910 0.8802 3.1699 0.6604 2.2611 0.8382 3.5745 4.4744 3.1746 8.6657 15.5165 134.0950 5.2761 3.2371 6.6268 149.8447 4.3735 6.2174 8.7096 0.3668 12.4208 113.1834 2.6373 5.8142 38.6246 3.1790 9.1030 2.0173 7.7367 4.0758 0.1503 3.2237 2.9084 70.4396 3.1351 31.6450 57.1884 20.7412 7.6140 24.1865 2.4866 0.4269 20.9268 37.5259 39.3536 49.9813 139.6514 219.6776 7.7251 202.1254 358.9320 45.9532 37.7469 56.3577 25.8786 24.9065 226.2562 15.9194 763.5511 37.2267 12.0175 205.7239 38.5543 126.0714 1.1394 157.6910 26.0695 41.2720 46.0129 18.5199 39.8790 161.2782 340.8769 117.4282 21.9243 190.3068 196.0096 329.3724 535.5509 427.7734 87.3216 37.2308 0.4000 23.9224 12.5995 10.1739 1.3726 9.5333 7.0857 8.3874 5.7860 141.3147 53.9764
temp: 298.150 k
press: 1.00000 atm
elementType: 8 8 8 8 8 6 6 6 6 6 6 6 6 6 6 6 6 6 6 6 6 1 1 1 1 1 1 1 1 1 1 1 1 1 1
symmnumber: 1
zpe: 688261.0 jmol-1
zpe.correction: 0.262145 hartree
zpe.thermalcorrener: 0.281381 hartree
zpe.thermalcorrenthalpy: 0.282325 hartree
zpe.thermalcorrgfe: 0.213075 hartree
zpe.sumelectzpe: -992.702308 hartree
zpe.sumelectthermal: -992.683072 hartree
zpe.sumelectthermalent: -992.682128 hartree
zpe.sumelectthermalfe: -992.751378 hartree
dipole: 4.8536 0.8774 0.9137
dipole: 5.0162
quadrupole: -77.0240 -123.2139 -127.9127
quadrupole: -16.1705 5.2650 4.1141
quadrupole: 32.3595 -13.8304 -18.5292 -16.1705 5.2650 4.1141
hfenergy: -992.9644527 hartree
pointgroup: C01 [X(C16H14O5)]
dipole: -1.8527603 0.3635984 -0.5743016 debye
polarizability: 472.6302257|3.8348835|206.3057622|12.5061393|-38.7045177|93.5006033 unknown
InChI: InChI=1S/C16H14O5/c1-21-16-8-10(3-7-14(16)19)2-6-13(18)12-5-4-11(17)9-15(12)20/h2-9,17,19-20H,1H3
charge 0 multiplicity 1
35 atoms
O  -4.025135 2.459203 -0.712259
O  4.146766 -2.39333 0.802398
O  -6.228522 0.67086 -0.194252
O  1.675599 -2.356751 0.724606
O  6.60487 1.675041 -0.16525
C  -2.200953 -0.656679 0.176012
C  2.901355 -0.353348 0.239914
C  -2.516856 0.670066 -0.236005
C  -3.844745 1.109435 -0.382701
C  -0.832219 -1.141767 0.34516
C  -3.27918 -1.553134 0.426995
C  1.637279 -1.087784 0.391975
C  4.143937 -1.068116 0.461258
C  -4.910221 0.197323 -0.097726
C  0.335586 -0.437968 0.180574
C  2.9862 1.029816 -0.110906
C  -4.61277 -1.129837 0.290107
C  5.38806 -0.405403 0.328725
C  4.211245 1.687849 -0.241797
C  5.413913 0.957329 -0.018608
C  -5.010921 2.807478 -1.759343
H  -1.731587 1.40052 -0.452652
H  -0.716462 -2.19463 0.640995
H  -3.063513 -2.581945 0.73521
H  0.319909 0.616813 -0.107949
H  2.070902 1.603382 -0.283516
H  -5.434225 -1.827662 0.499955
H  6.302707 -0.982458 0.504764
H  4.274973 2.745409 -0.509053
H  3.127535 -2.678525 0.848637
H  -6.872677 -0.031446 0.073058
H  -6.03384 2.547954 -1.44498
H  -4.762808 2.292239 -2.707076
H  -4.90604 3.895279 -1.886938
H  7.392037 1.100186 0.007869
