program: Gaussian 09
title: 000118564
version: EM64L-G09RevD.01
frameworkgroup: C1[X(C17H23N3O2)]
method: RPBEPBE
basis: SDD
operation: Freq
keyword: #p
keyword: freq=noraman
keyword: PBEPBE/SDD
title: #p freq=noraman PBEPBE/SDD
converged: YES YES NO NO
title: Mulliken charges:
elementType: O O N N N C C C C C C C C C C C C C C C C C H H H H H H H H H H H H H H H H H H H H H H H
charge: -0.236777 -0.252878 -0.215701 -0.198973 -0.348165 0.131131 0.285010 0.129702 -0.377167 -0.369884 0.157030 -0.346126 -0.813728 0.500521 -0.670740 -0.683118 -0.670085 -0.332915 -0.338423 -0.221031 -0.220026 -0.239605 0.217659 0.213060 0.204002 0.225433 0.229654 0.262300 0.279980 0.241941 0.239978 0.246328 0.215567 0.207069 0.278834 0.196488 0.203040 0.263017 0.210883 0.222136 0.252097 0.243717 0.225932 0.225576 0.227255
chargesum: 0.00000
title: Mulliken charges with hydrogens summed into heavy atoms:
elementType: O O N N N C C C C C C C C C C C C C C C C C
charge: -0.236777 -0.252878 -0.215701 -0.198973 -0.348165 0.131131 0.285010 0.129702 0.053552 0.059552 0.157030 0.145828 -0.051829 0.500521 -0.001775 -0.004756 0.025951 -0.080818 -0.094705 0.004901 0.005550 -0.012350
polarizability: 2.60231242e+02 -4.83692422e+00 2.39506858e+02 -3.92153858e+00 -8.05196341e+00 1.52164652e+02
1716.lowfreq: -8.5321 -7.6201 -0.0007 -0.0007 -0.0003 5.4685 27.6424 34.4454 45.6368
frequency: 27.5907 34.4179 45.5422 61.8973 65.4601 79.3985 86.6152 103.3054 120.6071 132.3584 157.2045 182.8336 192.8969 206.6558 210.8984 238.8127 254.8048 257.9455 280.2259 281.8539 297.8782 323.9397 356.1588 382.6980 392.4364 404.9515 408.1167 423.2328 430.3754 463.2971 494.4090 508.9859 529.0613 578.0327 586.5150 614.7374 636.4436 689.5292 696.6795 713.4940 738.1520 753.0155 769.3567 772.0522 786.0808 790.5821 824.2334 837.1736 906.8833 915.8211 924.4447 966.6440 970.6705 987.7127 990.2420 991.8195 1021.2465 1026.5660 1042.0601 1057.5556 1065.5420 1078.6282 1082.6075 1089.7439 1098.9435 1114.2919 1127.0511 1148.6633 1171.5502 1174.3869 1183.9416 1205.4773 1217.0150 1265.1331 1288.7840 1302.3633 1309.3871 1315.9822 1344.9875 1351.8695 1355.6231 1373.0599 1379.8197 1382.1501 1385.8872 1389.1667 1396.9362 1422.4448 1438.6677 1445.3729 1461.2853 1462.1104 1464.4658 1465.4950 1472.2299 1479.2039 1481.8775 1484.5684 1486.7940 1492.8267 1495.5760 1565.2961 1591.4536 1603.5081 1607.5637 1622.7416 2928.2283 2956.3567 2974.9476 2979.8392 2981.0021 2990.4259 3029.2462 3039.6286 3050.7209 3060.4160 3070.7038 3071.7461 3082.0889 3093.6425 3100.1019 3102.2119 3113.9864 3114.1494 3128.2890 3140.8776 3154.9433 3167.3499 3176.7064
redmass: 3.7129 3.7172 4.0145 4.8062 4.0772 4.3720 2.7709 3.1909 3.3000 2.3231 6.0772 2.4507 2.9341 1.1112 1.1906 1.9029 2.0391 1.9287 2.1899 2.4050 2.2070 2.9597 3.4835 3.8196 2.5010 3.9359 3.7010 4.3101 6.0681 3.9365 4.2260 3.6625 3.2692 5.0692 6.1739 6.3159 5.8691 2.7476 1.9127 8.9924 2.9640 2.4602 1.7667 1.4050 2.0466 1.2949 2.8196 1.2677 1.6476 1.9426 2.1253 1.4062 2.7963 2.4875 1.3790 5.9057 2.7969 2.0899 1.5241 2.2125 2.3339 1.7244 1.8016 2.0394 1.6636 2.2583 5.7356 3.6623 1.0557 2.4055 1.1481 2.7575 3.0208 2.2164 1.2835 1.4921 2.9088 1.3211 1.2104 1.3930 1.2689 1.2192 1.2577 1.3055 9.8443 1.3196 1.7589 3.3367 2.2192 1.0858 1.0604 1.0731 1.0595 1.0697 1.1158 1.1317 1.9446 1.1202 1.0645 1.0608 1.0695 7.9387 7.1927 7.0961 6.7245 9.2652 1.0707 1.0649 1.0411 1.0369 1.0367 1.0360 1.0959 1.0613 1.0930 1.0914 1.0977 1.0972 1.0986 1.1009 1.1000 1.0993 1.1031 1.1002 1.0850 1.0893 1.0942 1.0974 1.0991
irintensity: 1.2107 0.2668 2.1230 1.2104 1.0503 1.0757 0.2782 1.0975 1.6327 2.0238 2.5420 0.6888 0.2568 0.0364 0.8441 3.4940 3.9766 0.4290 1.5073 0.6100 1.4883 0.8696 6.2351 4.8739 3.7339 4.0711 7.0627 7.4839 7.4472 2.0635 0.0688 16.2840 12.9489 1.7719 0.8612 0.8686 27.9623 4.0544 48.7148 5.7135 7.7270 17.3743 35.3702 13.1607 1.1524 32.6387 3.7425 0.5004 2.2229 2.1515 3.2935 0.3642 9.1024 3.3859 0.2440 1.6554 11.1026 10.8977 1.9122 1.9795 1.6412 14.9061 21.7554 14.1275 15.9320 82.0292 21.4922 11.9525 0.0421 7.8722 3.1681 33.4180 48.7331 115.0842 8.1313 35.8850 152.7024 2.4777 8.1362 44.3958 11.3404 54.7585 46.6133 35.6737 1.9741 13.2589 83.9683 98.6956 17.0156 31.9707 19.5643 12.7572 10.7477 1.4417 19.4390 1.3546 36.6184 16.4507 1.4780 21.5775 16.3749 386.9023 232.3546 44.9588 42.8469 146.4935 84.7868 61.4161 31.5720 31.7728 52.6422 25.7011 21.0795 21.6060 12.8479 13.9459 25.2552 97.8084 32.6213 15.7715 26.1628 5.3478 18.1059 14.5403 0.0037 11.7531 39.1367 17.1720 3.2899
temp: 298.150 k
press: 1.00000 atm
elementType: 8 8 7 7 7 6 6 6 6 6 6 6 6 6 6 6 6 6 6 6 6 6 1 1 1 1 1 1 1 1 1 1 1 1 1 1 1 1 1 1 1 1 1 1 1
symmnumber: 1
zpe: 978992.1 jmol-1
zpe.correction: 0.372878 hartree
zpe.thermalcorrener: 0.395307 hartree
zpe.thermalcorrenthalpy: 0.396251 hartree
zpe.thermalcorrgfe: 0.321030 hartree
zpe.sumelectzpe: -974.675403 hartree
zpe.sumelectthermal: -974.652974 hartree
zpe.sumelectthermalent: -974.652030 hartree
zpe.sumelectthermalfe: -974.727251 hartree
dipole: -3.7168 2.4549 -0.1019
dipole: 4.4555
quadrupole: -120.1296 -128.4749 -128.2284
quadrupole: -10.8050 -4.4166 -4.9274
quadrupole: 5.4813 -2.8639 -2.6174 -10.8050 -4.4166 -4.9274
hfenergy: -975.0482812 hartree
pointgroup: C01 [X(C17H23N3O2)]
dipole: 1.5261096 0.8356819 -0.2130601 debye
polarizability: 259.4126303|2.1746497|239.4573577|-13.1710939|-4.1804989|153.0327642 unknown
InChI: InChI=1S/C17H23N3O2/c1-5-18(6-2)15-13(4)19(7-3)17(22)20(16(15)21)14-11-9-8-10-12-14/h8-12H,5-7H2,1-4H3
charge 0 multiplicity 1
45 atoms
O  0.019627 -1.923609 0.606108
O  -1.579846 2.315793 -0.661385
N  2.760579 -1.037137 0.359412
N  0.729638 1.9691 -0.53243
N  -0.789249 0.21527 0.060581
C  1.647967 -0.182893 0.149243
C  1.829185 1.158078 -0.197049
C  0.283358 -0.726886 0.289253
C  3.596106 -1.425049 -0.79921
C  2.861968 -1.847807 1.600778
C  -0.613511 1.545954 -0.391628
C  0.894163 3.367404 -1.02669
C  3.207548 1.771271 -0.228315
C  -2.16194 -0.242767 0.255125
C  2.854744 -2.245495 -1.883247
C  2.693028 -3.375072 1.438386
C  0.767654 4.418282 0.094141
C  -2.653855 -1.331712 -0.495928
C  -2.980439 0.40366 1.206811
C  -3.977665 -1.776916 -0.289124
C  -4.305099 -0.041864 1.404169
C  -4.80663 -1.133853 0.658651
H  4.031849 -0.522511 -1.275871
H  4.450215 -2.0081 -0.406038
H  3.849488 -1.640877 2.070699
H  2.091809 -1.475334 2.29854
H  1.867448 3.43707 -1.537488
H  0.098339 3.534414 -1.771519
H  3.872137 1.127695 0.370818
H  3.212287 2.789975 0.19495
H  3.627541 1.828448 -1.251791
H  2.452676 -3.183804 -1.466505
H  2.006967 -1.667615 -2.29439
H  3.538369 -2.490217 -2.718797
H  1.690792 -3.598639 1.040781
H  3.459423 -3.804338 0.766471
H  2.805826 -3.865408 2.424135
H  -0.233286 4.36113 0.552648
H  1.528033 4.275073 0.882732
H  0.895143 5.432019 -0.327209
H  -2.003925 -1.833178 -1.218016
H  -2.588619 1.253615 1.773596
H  -4.359247 -2.625542 -0.867138
H  -4.942884 0.462921 2.137915
H  -5.834111 -1.48065 0.815524
