program: Gaussian 09
title: 000118559
version: EM64L-G09RevD.01
frameworkgroup: C1[X(C8H12N4)]
method: RPBEPBE
basis: SDD
operation: Freq
keyword: #pfreq=noraman
keyword: PBEPBE/SDD
title: #p freq=noraman PBEPBE/SDD
converged: YES YES NO NO
title: Mulliken charges:
elementType: N N N N C C C C C C C C H H H H H H H H H H H H
charge: -0.117058 -0.120601 -0.081374 -0.635660 -0.451544 -0.450739 -0.352499 -0.357075 0.053516 0.221637 -0.271478 -0.351575 0.225552 0.219748 0.224745 0.220082 0.224016 0.250019 0.222084 0.244237 0.231393 0.219446 0.321865 0.311261
chargesum: 0.00000
title: Mulliken charges with hydrogens summed into heavy atoms:
elementType: N N N N C C C C C C C C
charge: -0.117058 -0.120601 -0.081374 -0.002534 -0.006244 -0.005911 0.121536 0.109246 0.053516 0.221637 -0.040085 -0.132129
polarizability: 1.68687923e+02 -3.10975496e+00 1.17727581e+02 4.53580401e-02 -1.37965575e+00 6.35420886e+01
1716.lowfreq: -21.8311 -17.0463 -9.4388 0.0006 0.0009 0.0010 44.3879 86.5219 132.9698
frequency: 44.0085 86.2758 132.9602 144.1069 197.9068 233.9210 243.7106 323.2233 364.5034 386.4704 446.8419 495.1975 508.0321 546.0546 568.0002 664.0807 684.8768 741.6049 761.2152 793.9141 842.3848 861.1504 882.1408 908.2354 914.8113 919.1333 953.0417 967.3191 999.2584 1051.4651 1069.8436 1109.1460 1127.0224 1157.7778 1168.6818 1188.3272 1213.1706 1237.1191 1280.0198 1299.6985 1307.8658 1310.0920 1332.9386 1336.4789 1348.5936 1430.7935 1468.1867 1473.1013 1492.6615 1498.2964 1513.9922 1555.5643 1565.6774 1618.1614 2972.4094 2978.0721 3006.7672 3007.2793 3053.9358 3061.9883 3075.1562 3088.7546 3124.5815 3169.7011 3551.0464 3708.5148
redmass: 3.0148 2.9553 3.9811 3.2791 3.9278 2.1299 2.9879 3.8831 3.8745 1.1825 2.4701 4.1302 1.2053 7.2650 1.8247 5.5493 4.1657 2.7019 2.5754 2.4315 1.8316 1.9185 4.0948 3.1537 1.5331 3.2723 1.3967 1.7353 2.0689 1.9719 1.9272 1.4844 1.7757 1.4237 1.5595 2.7520 1.2786 1.4411 4.4758 1.4162 1.3014 1.6475 1.6069 1.7515 2.2784 3.2750 1.0888 1.0981 1.0818 1.1133 6.4872 3.2723 6.1051 1.5190 1.0671 1.0685 1.0639 1.0633 1.0954 1.0951 1.1005 1.1053 1.0901 1.0964 1.0448 1.1045
irintensity: 2.2970 0.5440 3.6093 7.0345 5.9093 0.2416 0.0286 0.4463 6.5199 226.7597 7.7052 6.6123 76.3175 5.9361 1.3585 1.2344 2.4223 1.3234 1.6254 71.0069 5.1885 2.3278 7.4582 12.4020 0.8929 1.9608 0.7238 5.7576 2.7243 0.3788 1.2322 7.9071 0.0099 2.9145 0.4673 9.3525 16.6859 6.1849 8.5529 2.9040 14.7247 43.3325 0.4818 40.5694 30.1456 134.4789 8.6844 37.4103 3.1072 50.2306 229.8823 223.6316 771.5623 295.9281 63.7829 26.3399 32.8562 34.2197 27.7383 19.0248 36.2138 69.7714 25.9646 19.7413 65.8371 31.6399
temp: 298.150 k
press: 1.00000 atm
elementType: 7 7 7 7 6 6 6 6 6 6 6 6 1 1 1 1 1 1 1 1 1 1 1 1
symmnumber: 1
zpe: 523768.5 jmol-1
zpe.correction: 0.199493 hartree
zpe.thermalcorrener: 0.210259 hartree
zpe.thermalcorrenthalpy: 0.211204 hartree
zpe.thermalcorrgfe: 0.162700 hartree
zpe.sumelectzpe: -530.172079 hartree
zpe.sumelectthermal: -530.161312 hartree
zpe.sumelectthermalent: -530.160368 hartree
zpe.sumelectthermalfe: -530.208871 hartree
dipole: 0.5852 -2.0456 0.0490
dipole: 2.1282
quadrupole: -49.9475 -68.3526 -73.8674
quadrupole: -3.6039 0.0986 -0.0472
quadrupole: 14.1083 -4.2968 -9.8115 -3.6039 0.0986 -0.0472
hfenergy: -530.3715714 hartree
pointgroup: C01 [X(C8H12N4)]
dipole: -0.2166472 0.8080437 0.0348603 debye
dipolederiv: -1.8584741 -0.1364967 0.0188733 -0.2483979 -0.4417308 -0.0610006 -0.0006671 0.0057642 -0.305042 -1.4987525 0.2544395 0.0266519 0.4686793 -0.5247277 -0.0206858 0.0389867 -0.0193137 -0.2604778 -1.2830551 0.0564153 0.0130725 -0.708211 -0.6076831 -0.0125392 -0.026177 -0.0233031 -0.2400904 -0.7008722 0.5714914 0.0312743 0.781263 -1.0057688 -0.0200415 0.042272 -0.0191806 -0.7357476 0.049745 -0.0500787 -0.0361775 -0.0177634 0.0145414 0.0314623 0.0320876 0.006595 0.1502438 0.0317133 0.0539576 0.0258673 0.0192746 0.0384697 0.0424885 -0.0319444 0.0040433 0.1489231 0.4895344 -0.1766915 -0.0534496 -0.3440487 0.2853314 0.0436762 0.0009309 0.0789935 0.2887258 0.3119743 0.1633033 0.0382993 0.3588171 0.4035714 0.0507284 -0.022582 0.0706787 0.2941968 2.3188152 0.1086945 -0.0192538 0.3343692 0.4738609 0.0183313 -0.0064276 0.0143293 0.1916776 1.2966431 -0.431359 -0.0322001 -0.7818276 1.3655195 0.0667791 -0.0459899 0.0639734 0.2004214 1.0542931 -0.201341 -0.0197046 -0.0757359 0.5106887 0.0294256 -0.0165425 0.0299868 -0.0554183 -0.4161701 -0.024345 0.0007541 0.4390271 -0.7837289 -0.0308192 0.0222958 -0.0247855 -0.2586951 -0.1295378 0.09607 0.0533912 0.1256722 0.0138461 -0.0317525 0.0929398 -0.0494522 0.0538456 0.0654698 -0.0119515 -0.0163993 -0.0393316 0.044616 -0.013331 -0.0866396 0.0141058 -0.1684862 -0.056497 -0.1108718 -0.0392194 -0.1496717 -0.0606989 -0.0447802 -0.0720145 -0.0725265 0.0552328 0.0495142 0.01403 0.0161415 0.0408777 0.0588235 -0.0078157 0.0753018 0.0359592 -0.1692621 -0.0304297 0.0142811 -0.0025808 0.1202064 -0.0059833 -0.0725356 0.0555417 -0.1240192 -0.1277219 0.0375712 -0.051471 0.033262 0.0507794 -0.0509862 0.0749336 -0.0029663 0.088459 -0.0065857 0.0035477 -0.0068124 0.0246311 -0.1193113 -0.0408126 -0.0705441 -0.0182901 -0.1323377 -0.1297035 0.0177708 0.0780433 -0.0586088 -0.0265197 -0.0475427 0.0641048 -0.023332 0.0870396 -0.0111824 0.0412108 -0.0814497 -0.0034029 -0.1164295 -0.1040163 -0.0101575 -0.0052492 -0.0110714 0.1173807 -0.1415778 -0.0376702 0.0010912 -0.0121864 0.076319 -0.0069562 0.0023273 -0.0055956 0.2064083 0.1664239 -0.0322882 -0.0003136 -0.0444175 0.2103014 -0.0081936 -0.0016191 -0.0078858 0.3739954 0.1811395 -0.0578992 -0.0019994 -0.0551138 0.1777902 -0.010777 -0.0022425 -0.0104565 0.3873615 unknown
polarizability: 168.5590785|-3.9194467|117.783017|-1.1752404|2.3160251|63.6154977 unknown
InChI: InChI=1S/C8H12N4/c9-7-3-4-10-8(11-7)12-5-1-2-6-12/h3-4H,1-2,5-6,9H2
charge 0 multiplicity 1
24 atoms
N  1.197479 -0.028624 0.011735
N  -0.962067 0.876709 0.08517
N  -0.585267 -1.555332 -0.050905
N  -3.10838 1.785529 0.144325
C  3.524683 -0.403632 0.273323
C  3.300381 1.028578 -0.28271
C  2.191476 -1.12665 -0.036814
C  1.814962 1.316514 0.044114
C  -0.156083 -0.240033 0.017014
C  -2.310041 0.658842 0.080159
C  -1.939834 -1.718632 -0.045421
C  -2.86322 -0.659198 0.016163
H  4.390268 -0.912643 -0.183416
H  3.68792 -0.364013 1.36639
H  3.977762 1.776033 0.164014
H  3.454313 1.037805 -1.377763
H  2.197992 -1.597848 -1.039959
H  1.932857 -1.914372 0.690525
H  1.691785 1.775531 1.045882
H  1.323549 1.985606 -0.683047
H  -2.289984 -2.756574 -0.095407
H  -3.941258 -0.838381 0.01581
H  -2.653527 2.694764 0.189772
H  -4.121566 1.718921 0.146045
