program: Gaussian 09
title: 000118553
version: EM64L-G09RevD.01
frameworkgroup: C1[X(C9H10N2O2)]
method: RPBEPBE
basis: SDD
operation: Freq
keyword: #p
keyword: freq=noraman
keyword: PBEPBE/SDD
title: #p freq=noraman PBEPBE/SDD
converged: YES YES NO NO
title: Mulliken charges:
elementType: O O N N C C C C C C C C C H H H H H H H H H H
charge: -0.341837 -0.262769 -0.450856 -0.627010 0.323158 0.119144 -0.341018 -0.307564 -0.219836 -0.277295 0.201749 0.200558 -0.787130 0.317146 0.196115 0.384297 0.233662 0.232071 0.242962 0.257995 0.240084 0.324622 0.341750
chargesum: 0.00000
title: Mulliken charges with hydrogens summed into heavy atoms:
elementType: O O N N C C C C C C C C C
charge: -0.341837 -0.262769 -0.066559 0.039362 0.323158 0.119144 -0.023871 -0.111449 0.013826 -0.045224 0.201749 0.200558 -0.046089
polarizability: 1.68425659e+02 -3.55908151e+00 1.45840257e+02 7.99027978e-01 -7.49246873e-01 5.33212646e+01
1716.lowfreq: -66.6877 -8.4453 -4.2320 -0.0007 -0.0006 -0.0004 8.7690 35.9759 82.1499
frequency: -66.6858 35.9074 82.1472 97.1526 146.3437 150.6446 253.9695 270.3964 319.7950 324.5757 405.3791 412.8056 478.0956 487.1153 524.8578 538.9588 583.6020 590.0872 597.6411 649.8428 694.0688 744.9065 753.8397 784.5353 828.5987 882.3392 932.7888 950.8290 961.4589 993.7547 1008.7038 1034.6509 1039.9810 1046.1819 1098.4830 1148.1865 1181.4378 1233.8933 1258.4727 1312.1659 1344.7566 1376.1039 1400.4838 1434.5607 1443.8775 1460.1774 1463.9284 1510.6350 1564.5115 1588.8793 1616.5601 1625.5982 1651.5589 2992.0891 3077.5288 3124.2655 3136.3011 3139.9000 3141.0129 3165.5417 3188.5004 3538.5885 3691.4596
redmass: 1.0467 4.8754 3.4315 5.4689 5.1912 4.5785 5.9104 4.5914 5.3230 4.2285 3.2559 4.1701 1.8795 2.0775 2.9454 4.6586 1.2688 3.0067 4.3308 5.3918 3.7075 4.4539 1.7688 2.7065 4.6879 1.4335 5.8451 1.3767 1.1155 1.6678 1.3157 1.6714 2.0100 2.9017 2.3437 1.8307 1.0873 3.2971 1.5644 2.1289 4.1307 1.2454 6.8432 2.4001 1.6112 1.5875 1.0517 3.1858 2.9026 4.7216 1.8831 4.0779 2.1652 1.0378 1.0979 1.0867 1.0987 1.0865 1.0875 1.0980 1.0957 1.0453 1.1037
irintensity: 1.0735 3.2842 6.5454 9.1757 2.0254 8.2868 5.5839 1.1956 2.6365 1.1112 3.8515 0.3003 46.7349 85.6962 15.8902 7.4993 113.1326 0.5737 20.8492 7.8382 64.6544 4.2678 63.3657 15.0993 1.8658 5.3008 20.5492 2.4288 91.8105 17.6238 4.4907 16.1733 7.8642 9.7730 0.9736 2.9115 6.2975 56.6503 11.1779 127.2072 423.0751 57.9353 102.7130 2.7506 91.6416 37.5873 17.8843 455.7741 82.6735 402.1372 168.7796 114.3435 22.7508 4.8905 13.0628 4.9949 37.9544 234.7873 68.8519 19.8616 13.9562 62.3229 34.6692
temp: 298.150 k
press: 1.00000 atm
elementType: 8 8 7 7 6 6 6 6 6 6 6 6 6 1 1 1 1 1 1 1 1 1 1
symmnumber: 1
zpe: 469626.5 jmol-1
zpe.correction: 0.178871 hartree
zpe.thermalcorrener: 0.190195 hartree
zpe.thermalcorrenthalpy: 0.191139 hartree
zpe.thermalcorrgfe: 0.140917 hartree
zpe.sumelectzpe: -608.014835 hartree
zpe.sumelectthermal: -608.003512 hartree
zpe.sumelectthermalent: -608.002567 hartree
zpe.sumelectthermalfe: -608.052790 hartree
dipole: -4.8835 -1.7176 -0.3667
dipole: 5.1897
quadrupole: -63.4754 -72.7346 -79.4514
quadrupole: -3.2606 2.5316 2.1165
quadrupole: 8.4117 -0.8474 -7.5643 -3.2606 2.5316 2.1165
hfenergy: -608.1937064 hartree
pointgroup: C01 [X(C9H10N2O2)]
dipole: -1.8794029 -0.6623889 -0.4449071 debye
dipolederiv: -0.8879271 0.1076965 -0.1486851 0.1419417 -0.9377313 0.021521 -0.1499933 -0.0353531 -0.425012 -0.9333063 -0.0192722 -0.0626804 -0.5970348 -0.8014474 -0.064006 -0.0663497 -0.0014363 -0.3524828 -2.2109924 0.1041377 -0.2117513 0.1169118 -0.5529151 -0.0109164 -0.168362 0.0047343 -0.3166245 -1.0681081 -0.4990061 -0.1118005 -0.5023927 -0.6066917 -0.1596154 -0.1211483 -0.1624877 -0.7088453 1.0498401 -0.1441394 0.1055747 -0.8675372 0.3377087 -0.0837015 0.0877643 0.0180299 0.1226245 -0.2874838 0.1328244 -0.0335405 -0.3408699 -0.7377 -0.1004879 -0.0675443 -0.0253194 -0.0572615 -0.2195412 0.0733478 -0.0011874 0.4899952 -0.2333113 0.0505018 0.0080728 -0.0014769 -0.1613014 0.0074398 -0.1780837 -0.0178717 0.1953945 0.2819437 0.0456066 -0.0043256 -0.0429519 -0.1441744 0.3129621 0.1279038 0.0581571 -0.0451406 0.2062 0.0162753 0.0406592 0.028305 -0.120604 -0.1678075 -0.1872915 -0.0257376 -0.233766 -0.2882219 -0.0334964 -0.0293453 -0.0227748 -0.1878451 1.3982539 0.2822354 0.3853958 0.4355101 1.612126 0.203836 0.4089631 0.2393867 0.3960931 2.2626525 -0.0792705 0.2233065 0.5515419 0.9939902 0.0551324 0.238854 -0.0206658 0.1947305 -0.2150486 0.1757837 -0.0265985 0.3274798 -0.2827549 0.0388635 -0.0479895 0.0362577 0.0389503 0.1259884 -0.0762252 -0.0120201 -0.0273317 0.1179065 -0.008848 -0.0111948 -0.0078779 0.1784538 -0.0926122 -0.0904004 -0.0252926 -0.1232101 0.0340407 -0.0188491 -0.0258653 -0.0095593 0.139603 0.4108626 0.1220703 0.0341971 0.3069202 0.385595 0.055526 0.0152035 0.0128265 0.2968064 0.0926738 -0.0134985 -0.0055876 0.0042686 -0.1132436 -0.0186301 -0.0028196 -0.0184486 0.1492929 -0.0626447 0.1050796 -0.0105749 0.0870115 0.0199255 -0.0043498 -0.0059198 0.0015472 0.1689182 0.0633293 -0.0154771 0.0672281 0.0119389 0.0448562 0.0810396 0.0281114 0.0963897 -0.0283323 -0.0840112 -0.0201303 -0.0100423 -0.0891638 0.0750725 -0.0031291 -0.003463 -0.0028007 0.1280443 0.0767275 -0.0150651 -0.0598473 0.0164207 0.028646 -0.0872848 -0.0158848 -0.1094941 -0.0229485 0.2188923 0.0720542 -0.0529459 0.0834413 0.2000713 0.0242713 -0.0593401 0.0237326 0.3528258 0.2098608 0.0347266 -0.0576954 0.0576707 0.215935 0.000741 -0.0480831 -0.0005628 0.3590889 unknown
polarizability: 166.4378205|-4.4752347|145.2934637|14.9861999|6.5812757|55.8558958 unknown
InChI: InChI=1S/C9H10N2O2/c1-6(12)11-8-5-3-2-4-7(8)9(10)13/h2-5,11H,10H2,1H3
charge 0 multiplicity 1
23 atoms
O  -0.132983 -2.538774 -0.205698
O  3.128505 1.169481 0.216458
N  1.40158 -0.428865 0.027421
N  -2.321891 -2.291893 -0.848236
C  0.248889 0.376762 -0.066699
C  -1.030357 -0.262363 -0.26649
C  0.310271 1.797715 0.032743
C  -2.196515 0.551211 -0.306497
C  -0.864007 2.566863 -0.033265
C  -2.128944 1.950286 -0.19216
C  -1.124133 -1.747993 -0.42839
C  2.735875 -0.034533 0.166255
C  3.700774 -1.214838 0.262127
H  1.28836 2.263572 0.16464
H  -3.186939 0.090113 -0.39701
H  1.175507 -1.448897 0.002614
H  -0.793269 3.656948 0.051172
H  -3.043242 2.551314 -0.219588
H  3.50415 -1.808129 1.17415
H  4.729898 -0.829988 0.300362
H  3.595652 -1.890778 -0.605937
H  -3.119802 -1.734065 -1.13906
H  -2.36408 -3.306047 -0.94051
