program: Gaussian 09
title: 000118552
version: EM64L-G09RevD.01
frameworkgroup: C1[X(C12H16O2)]
method: RPBEPBE
basis: SDD
operation: Freq
keyword: #pfreq=noraman
keyword: PBEPBE/SDD
title: #p freq=noraman PBEPBE/SDD
converged: YES YES NO NO
title: Mulliken charges:
elementType: O O C C C C C C C C C C C C H H H H H H H H H H H H H H H H
charge: -0.320916 -0.400903 -0.352229 -0.514628 -0.344359 0.206678 0.126223 -0.694664 0.165791 -0.336250 0.494800 -0.560474 -0.396372 -0.806611 0.210284 0.215168 0.233862 0.234822 0.189932 0.189361 0.215766 0.212518 0.213109 0.243202 0.261040 0.232808 0.233017 0.232374 0.234995 0.381659
chargesum: 0.00000
title: Mulliken charges with hydrogens summed into heavy atoms:
elementType: O O C C C C C C C C C C C C
charge: -0.320916 -0.019243 0.073223 -0.045945 0.034933 0.206678 0.126223 -0.053272 0.165791 -0.093048 0.494800 -0.299434 -0.163565 -0.106225
polarizability: 2.07949157e+02 1.22003648e+01 1.41692205e+02 -2.49699351e-01 1.22894312e-01 7.82553615e+01
1716.lowfreq: -10.7810 0.0006 0.0007 0.0009 3.4167 8.9376 26.7550 38.7234 46.2499
frequency: 25.6876 38.6942 45.5601 72.0473 91.4141 116.2159 128.0008 192.6967 225.6387 236.6083 246.0375 265.7986 296.5724 366.0024 394.1570 441.1857 450.0015 500.0002 543.8356 566.3418 593.1904 601.1118 720.7179 723.9342 743.9521 761.4475 790.9365 812.2436 884.6256 901.2581 920.1618 929.9449 957.0721 961.6641 980.6902 1007.4566 1042.9551 1045.6992 1083.2362 1095.3201 1110.0178 1148.6193 1174.7824 1204.7796 1222.5045 1241.0501 1274.8144 1281.0571 1285.8794 1296.2513 1319.8971 1350.4433 1381.2033 1392.4180 1395.2405 1399.2961 1406.8839 1434.0001 1464.1930 1467.3089 1472.5730 1474.4198 1478.0707 1487.3895 1496.0535 1555.9556 1575.3366 1644.2886 2738.9565 2958.7764 2960.8786 2974.8769 2979.4136 2997.3840 3001.7189 3006.7564 3056.7581 3057.7893 3072.8080 3073.9939 3094.4672 3129.1942 3152.6259 3160.0825
redmass: 2.1945 1.3563 1.4778 3.8552 3.1834 4.0136 2.2490 3.5906 4.6548 1.1221 4.3818 4.2167 3.0300 4.0927 7.0490 2.8379 3.9573 4.5235 2.9925 5.6921 5.7298 2.9081 1.2098 5.9111 2.4441 5.4842 1.3116 1.3598 1.4616 1.7875 1.3335 2.8672 1.3002 1.0984 5.2481 1.5516 2.9306 1.5818 2.1779 1.4774 2.5056 1.6729 1.7739 1.4707 1.5715 1.6251 1.1834 2.8251 1.0631 1.7434 1.8127 1.6877 2.2646 1.2590 1.4719 2.1825 4.2282 1.2382 1.0723 1.0484 1.1379 1.0695 1.0420 1.0775 2.8320 5.1196 2.8262 5.1160 1.0714 1.0596 1.0596 1.0360 1.0377 1.0622 1.0959 1.0996 1.0970 1.1028 1.1008 1.0995 1.0988 1.0868 1.0963 1.0930
irintensity: 0.0131 0.3063 0.1114 0.4050 0.6671 0.1424 0.7684 2.3158 0.4411 0.0720 0.3751 0.7495 1.5617 9.2506 4.9003 8.1551 5.6289 12.1912 0.2156 0.8852 9.8364 2.1236 14.4135 8.7502 0.1603 4.9115 16.2550 29.4566 20.6674 18.9528 2.0223 11.4215 9.7098 110.4397 28.8724 20.0312 0.5704 16.7890 0.8987 0.3873 7.3527 31.6151 4.9189 0.0068 41.8941 33.7487 0.5591 114.6288 0.9960 54.0317 79.8675 40.9657 136.0352 34.5650 26.3205 35.6546 19.5663 11.7757 1.8850 15.6384 44.3443 8.1158 12.6100 19.2746 52.1301 39.3465 101.1478 254.4798 340.2247 13.1474 44.7532 35.7912 21.3196 26.3682 17.9798 0.2441 16.6405 14.3377 92.3081 51.2915 19.4558 6.9861 18.8331 3.4698
temp: 298.150 k
press: 1.00000 atm
elementType: 8 8 6 6 6 6 6 6 6 6 6 6 6 6 1 1 1 1 1 1 1 1 1 1 1 1 1 1 1 1
symmnumber: 1
zpe: 655860.6 jmol-1
zpe.correction: 0.249804 hartree
zpe.thermalcorrener: 0.264553 hartree
zpe.thermalcorrenthalpy: 0.265497 hartree
zpe.thermalcorrgfe: 0.206207 hartree
zpe.sumelectzpe: -616.288277 hartree
zpe.sumelectthermal: -616.273528 hartree
zpe.sumelectthermalent: -616.272584 hartree
zpe.sumelectthermalfe: -616.331874 hartree
dipole: -0.4740 -4.1007 -0.0221
dipole: 4.1281
quadrupole: -73.3789 -88.3741 -86.1743
quadrupole: 2.5725 -0.0525 0.0144
quadrupole: 9.2635 -5.7317 -3.5318 2.5725 -0.0525 0.0144
hfenergy: -616.5380807 hartree
pointgroup: C01 [X(C12H16O2)]
dipole: 0.1991079 1.608041 -0.1108147 debye
polarizability: 208.1217804|11.5580744|141.2277387|-2.1971115|-4.1738091|78.5472043 unknown
InChI: InChI=1S/C12H16O2/c1-3-4-5-11(13)10-7-6-9(2)8-12(10)14/h6-8,14H,3-5H2,1-2H3
charge 0 multiplicity 1
30 atoms
O  -1.138795 -1.751123 0.235957
O  1.289909 -2.435041 0.254422
C  -3.367881 -0.055235 0.198547
C  -1.951289 0.541519 0.093579
C  -4.467084 1.025016 0.091008
C  -0.835141 -0.495048 0.153895
C  0.576234 -0.087269 0.114841
C  -5.889068 0.434903 0.20603
C  1.603535 -1.100369 0.1690
C  0.988478 1.277151 0.025237
C  3.356774 0.61847 0.048713
C  2.973323 -0.732358 0.135796
C  2.342225 1.627362 -0.006806
C  4.820617 1.012965 0.009888
H  -3.467613 -0.599339 1.157168
H  -3.506451 -0.81502 -0.593645
H  -1.791298 1.284941 0.901792
H  -1.84919 1.109116 -0.855416
H  -4.366051 1.559634 -0.876197
H  -4.318493 1.786411 0.884701
H  -6.661919 1.221484 0.129342
H  -6.02569 -0.081143 1.174916
H  -6.07694 -0.304209 -0.595209
H  0.229268 2.065077 -0.018883
H  3.718581 -1.532581 0.180387
H  2.63565 2.681029 -0.074554
H  5.062991 1.719642 0.825609
H  5.482977 0.137144 0.108684
H  5.068096 1.521421 -0.94131
H  0.253246 -2.495647 0.26821
