program: Gaussian 09
title: 000118544
version: EM64L-G09RevD.01
frameworkgroup: C1[X(C6H10O4)]
method: RPBEPBE
basis: SDD
operation: Freq
keyword: #pfreq=noraman
keyword: PBEPBE/SDD
title: #p freq=noraman PBEPBE/SDD
converged: YES YES NO NO
title: Mulliken charges:
elementType: O O O O C C C C C C H H H H H H H H H H
charge: -0.278452 -0.442259 -0.226852 -0.189608 -0.588955 -0.250722 -0.325432 0.294724 0.240345 -0.752953 0.254328 0.258189 0.235506 0.243806 0.217493 0.212275 0.263105 0.249925 0.236674 0.348864
chargesum: 0.00000
title: Mulliken charges with hydrogens summed into heavy atoms:
elementType: O O O O C C C C C C
charge: -0.278452 -0.093395 -0.226852 -0.189608 -0.076439 0.228590 0.104336 0.294724 0.240345 -0.003248
polarizability: 9.43074829e+01 -3.90969878e-01 6.88062304e+01 -6.72232158e+00 5.75916026e-01 6.86141425e+01
1716.lowfreq: -10.7568 -1.3624 -0.0006 -0.0006 -0.0003 12.1758 18.6834 37.7163 53.6779
frequency: 17.3464 37.5534 53.6645 75.6909 103.5437 117.9524 175.3399 219.7514 291.5747 308.2329 375.9037 407.6176 453.4237 476.6700 515.8029 590.1614 709.3340 765.8023 823.9363 856.3760 864.8621 924.5568 962.3362 980.5904 1017.3316 1051.6378 1081.5488 1131.7568 1162.8086 1185.8808 1217.1665 1238.1534 1280.6770 1332.0058 1356.3006 1372.0564 1383.4229 1421.4502 1443.3759 1449.2504 1455.5473 1458.4878 1641.1176 1661.1949 2982.2207 2983.0830 3012.2810 3019.8698 3069.0826 3082.1946 3083.2135 3094.1540 3125.2473 3563.9126
redmass: 5.3215 3.8719 5.0381 4.2529 1.6621 1.7315 3.7469 5.5989 2.7267 2.7478 2.0152 1.2745 2.4983 2.6739 5.0888 4.8543 5.6493 2.4699 3.3354 1.8065 2.6775 3.9413 2.0314 2.4161 1.8032 2.9090 1.8516 2.0165 2.2897 1.1924 1.1987 1.9673 1.7124 1.2113 1.3814 1.2305 1.2751 1.1243 1.0637 1.0866 1.0578 1.0845 8.6725 9.6961 1.0672 1.0381 1.0603 1.0571 1.0954 1.1000 1.0967 1.1085 1.1004 1.0657
irintensity: 1.9619 3.1003 5.4393 4.5258 0.2769 1.1099 2.9458 12.7151 7.1291 2.8069 26.2015 157.1534 3.5767 8.1320 12.3531 10.6169 0.1021 9.5261 5.2548 6.0024 18.6745 40.7261 49.3385 50.0451 18.4569 48.4585 8.8293 186.6330 79.8329 8.6750 22.6187 176.5697 135.3583 10.2671 3.3952 56.4532 22.6975 35.7152 25.8714 14.7714 20.1892 5.8356 168.2120 147.3398 46.2420 2.2327 5.9693 13.2649 9.7583 4.4252 25.7972 23.5336 9.9341 5.6100
temp: 298.150 k
press: 1.00000 atm
elementType: 8 8 8 8 6 6 6 6 6 6 1 1 1 1 1 1 1 1 1 1
symmnumber: 1
zpe: 409508.4 jmol-1
zpe.correction: 0.155974 hartree
zpe.thermalcorrener: 0.167889 hartree
zpe.thermalcorrenthalpy: 0.168833 hartree
zpe.thermalcorrgfe: 0.115372 hartree
zpe.sumelectzpe: -534.719717 hartree
zpe.sumelectthermal: -534.707801 hartree
zpe.sumelectthermalent: -534.706857 hartree
zpe.sumelectthermalfe: -534.760318 hartree
dipole: 2.7034 -0.8402 -2.1555
dipole: 3.5581
quadrupole: -55.8202 -65.9991 -58.9170
quadrupole: -5.6447 -11.7149 0.8314
quadrupole: 4.4252 -5.7537 1.3284 -5.6447 -11.7149 0.8314
hfenergy: -534.8756903 hartree
pointgroup: C01 [X(C6H10O4)]
dipole: 0.9893674 0.940355 0.3107363 debye
dipolederiv: -1.462 0.0525939 -0.434787 0.0126595 -0.4896213 0.1358531 -0.5249876 0.1316994 -0.4998992 -0.2834862 0.181891 -0.0281856 0.2916032 -0.712758 0.0307199 -0.0231387 0.0028125 -0.6074789 -0.6267454 -0.0746243 -0.0371205 0.1489222 -0.733475 0.4200696 -0.2409611 0.210808 -0.5175646 -0.5367692 -0.1432927 -0.030449 -0.1006816 -0.4503362 -0.2571585 0.0700254 -0.2004609 -0.6941887 -0.5114438 -0.1644158 0.2991945 -0.0855787 -0.0755367 -0.0813747 0.3949488 0.0074866 -0.305582 0.6791914 0.1316244 0.0797858 0.2860895 0.186456 0.1128995 0.0257145 0.0751728 0.258425 0.2730785 -0.0977882 -0.0363667 -0.1879667 0.5907043 0.0853686 -0.0242911 0.0439479 0.3703716 1.6196569 0.0680684 0.3253505 -0.1237624 0.9437843 -0.6676392 0.6614075 -0.4034698 0.583582 1.0728245 0.3323121 -0.2252265 0.1895515 0.3674373 0.3642918 -0.4847441 0.2280575 0.9460875 -0.5005921 -0.2293855 -0.0042472 -0.1553061 -0.0286266 -0.0125081 0.027817 -0.0110195 -0.050908 -0.0056925 -0.0155094 -0.0771315 -0.039722 0.097144 0.0469866 -0.0801759 -0.0134077 0.0230488 0.0945724 0.0467617 0.0222456 0.0057305 -0.0321685 0.0243141 -0.0144189 0.0267003 0.1145326 -0.0198219 0.0885138 0.0054261 -0.0221586 -0.0695592 -0.0603961 -0.0089591 -0.0291274 0.0672615 -0.0443678 -0.0290221 0.0111316 -0.0728831 0.0768096 -0.0400939 0.0581285 0.0235948 -0.0904986 -0.0828535 -0.1050425 -0.0437385 -0.0510945 -0.0280383 -0.0243692 -0.0163625 -0.0100615 0.0973493 0.0183469 0.0516397 0.1429799 0.0473293 -0.0036797 0.0123104 0.0902209 -0.0290233 -0.1330922 0.0475607 -0.0310843 0.0581052 -0.0340686 0.1038403 -0.0156357 0.0979661 0.0173008 -0.0508726 0.0566778 0.021365 -0.0509125 0.0544618 0.0511295 0.0758793 -0.0656546 0.0786915 0.0448358 0.0946995 0.0549709 0.0242698 -0.0036571 -0.070155 -0.0787918 0.0397909 -0.0817758 0.0848126 0.1171638 -0.139576 -0.000324 -0.1594681 0.276649 -0.0707255 0.0176739 -0.0679261 0.3597781 unknown
polarizability: 93.2107397|7.2518916|70.2510441|4.3851762|0.2239746|68.2660721 unknown
InChI: InChI=1S/C6H10O4/c1-5(8)4-6(9)10-3-2-7/h7H,2-4H2,1H3
charge 0 multiplicity 1
20 atoms
O  -1.049813 0.227083 0.169824
O  -3.683556 1.201295 -0.525053
O  0.108335 -1.339807 1.449768
O  1.706614 -0.22839 -1.451411
C  1.214523 0.747244 0.748279
C  -2.220364 -0.704072 0.094491
C  -3.158284 -0.101098 -0.9458
C  0.068657 -0.240337 0.858165
C  2.088844 0.499598 -0.504708
C  3.442534 1.194862 -0.496347
H  1.846999 0.675308 1.650392
H  0.82646 1.781175 0.684067
H  -1.86072 -1.709397 -0.18869
H  -2.689069 -0.747541 1.093332
H  -4.043309 -0.74895 -1.062439
H  -2.635194 -0.028966 -1.921469
H  3.86446 1.217133 -1.512893
H  4.135759 0.63137 0.158748
H  3.371909 2.220269 -0.091026
H  -2.910388 1.798822 -0.358829
