program: Gaussian 09
title: 000118868
version: EM64L-G09RevD.01
frameworkgroup: C1[X(C26H16O2S)]
method: RPBEPBE
basis: SDD
operation: Freq
keyword: #p
keyword: freq=noraman
keyword: PBEPBE/SDD
title: #p freq=noraman PBEPBE/SDD
converged: YES YES NO NO
title: Mulliken charges:
elementType: S O O C C C C C C C C C C C C C C C C C C C C C C C C C C H H H H H H H H H H H H H H H H
charge: 0.221333 -0.276275 -0.209896 0.109985 0.513110 0.323785 0.293512 0.253103 -0.436608 0.458655 -0.049379 0.061400 -0.264458 -0.428203 -0.516372 -0.459359 -0.332682 -0.378148 0.326132 -0.333485 -0.291666 -0.262430 -0.239216 -0.407454 -0.367179 -0.515493 -0.237174 -0.239945 -0.243127 0.218664 0.295139 0.290424 0.247152 0.221397 0.246838 0.235409 0.239389 0.264492 0.263245 0.232183 0.237504 0.260228 0.225315 0.223815 0.226343
chargesum: 0.00000
title: Mulliken charges with hydrogens summed into heavy atoms:
elementType: S O O C C C C C C C C C C C C C C C C C C C C C C C C C C
charge: 0.221333 -0.276275 -0.209896 0.109985 0.513110 0.323785 0.293512 0.253103 -0.436608 0.458655 -0.049379 0.061400 -0.264458 -0.209540 -0.221233 -0.168934 -0.085530 -0.378148 0.326132 -0.112088 -0.044827 -0.027021 0.000173 -0.142962 -0.103934 0.214421 -0.011860 -0.016130 -0.016784
polarizability: 6.40502478e+02 -1.52817914e+01 3.22976080e+02 -1.74320272e+00 1.36755166e+01 1.41364421e+02
1716.lowfreq: -5.2064 0.0007 0.0010 0.0012 0.7907 4.4318 10.2335 29.4619 48.4132
frequency: 10.0012 29.4488 48.4068 65.1905 67.5486 78.7398 104.5311 118.2953 131.9224 170.5146 182.4173 191.2882 205.4718 208.3413 233.5890 272.8436 280.7719 296.2488 312.0946 315.7906 363.6937 390.4419 404.3413 408.2442 420.6246 431.8338 436.5547 464.2750 472.2435 474.8005 490.5805 511.9265 538.2325 543.3481 587.2137 614.4396 618.9045 627.5337 629.7251 644.7017 673.4968 697.8938 708.5239 714.7115 729.6783 744.7002 761.0094 771.4039 783.9866 791.8670 823.4579 840.7078 850.7887 859.8543 864.0327 881.7729 887.8579 911.9137 927.7764 951.2670 974.7808 980.5981 985.4557 987.5244 989.2550 993.0048 1005.9128 1026.5643 1033.8909 1041.8862 1068.8172 1083.3275 1102.6621 1111.4507 1124.1542 1133.6242 1148.6548 1153.1865 1171.7355 1174.8546 1182.3056 1192.8168 1204.7795 1242.8882 1257.9958 1288.3086 1298.0101 1311.1185 1327.9100 1335.6108 1369.1486 1372.9590 1375.5181 1386.8925 1420.0471 1425.3844 1432.0666 1442.9378 1454.1150 1454.7695 1472.0902 1475.6395 1480.4004 1501.7121 1527.5578 1545.3228 1565.4135 1572.3414 1582.1158 1588.6506 1602.3738 1608.3657 1613.3273 2990.7838 3100.9746 3112.8283 3120.3932 3129.8531 3133.7785 3142.2862 3142.6144 3145.3887 3152.4116 3158.0166 3165.2167 3176.4714 3177.6620 3184.8711 3188.7546
redmass: 6.0610 6.6912 4.1167 5.4238 5.5489 4.9865 3.4397 3.0896 4.4988 4.4269 1.5329 4.4560 6.9378 5.2722 3.8720 4.8296 5.5757 5.2782 4.8797 8.0730 7.4595 9.1141 2.8798 5.7924 7.9422 6.6565 3.7376 5.9332 5.2404 3.6158 7.1385 4.0520 5.1815 5.3518 8.0730 6.4458 6.7309 4.7558 6.9403 5.3732 6.5824 2.0798 5.0038 4.6949 2.2172 2.4570 4.1765 1.8932 5.6216 3.0762 5.7564 1.7970 1.2621 1.9203 1.6245 3.6545 3.2421 4.3269 1.8544 1.3958 1.4099 1.4194 5.9494 1.3543 4.2827 1.4495 1.4063 2.9369 3.2829 3.8891 2.9311 1.7258 2.8276 1.2594 2.2726 2.2032 1.5465 1.6929 1.0546 2.0073 1.1984 1.1187 1.5427 3.4696 1.7442 2.8426 2.2282 1.9425 1.9428 3.3025 5.7916 6.4012 5.5706 6.3418 3.1111 2.2611 1.8031 1.8600 1.1810 2.0389 1.0994 2.7628 2.1955 7.5113 6.2416 7.3178 5.3463 6.0561 6.0990 7.1524 6.9589 6.4921 7.6091 1.0284 1.1046 1.1052 1.0848 1.0885 1.0870 1.0903 1.0942 1.0900 1.0896 1.0989 1.0962 1.0974 1.0967 1.0941 1.0909
irintensity: 0.9664 0.4499 1.4077 0.9694 0.5570 0.7041 2.7293 6.9629 0.8239 0.0247 3.7840 3.9202 3.3938 1.1102 3.8761 3.2561 0.3885 1.7461 4.6029 1.6971 2.0277 9.3250 0.0402 0.6013 9.3576 13.3926 2.0634 8.3169 14.2442 0.4496 7.7577 4.3934 2.9675 1.8002 1.1769 0.5378 0.6389 2.4003 20.7636 3.3750 2.6773 25.6925 30.9989 3.6416 13.7149 43.5928 8.2212 51.6850 5.3460 50.3467 4.6695 35.4323 0.4511 0.5355 0.6943 22.1656 19.0538 24.8746 3.4075 1.4636 1.8769 1.3249 13.2252 0.1433 5.6936 1.7707 1.8370 31.6216 24.2015 7.1309 62.5312 24.2529 54.2336 4.7121 10.0412 37.7185 2.3631 5.1953 0.0074 68.5990 13.5512 6.4382 31.6289 10.8646 3.3181 142.9375 61.0530 44.6922 71.7023 125.3733 20.6218 0.3252 23.1182 0.9255 135.5111 10.4208 2.5769 23.3223 9.8824 19.9006 31.8994 12.3655 21.5983 171.1702 45.7365 71.0541 90.1485 16.9099 4.2824 179.4526 43.1010 16.7886 51.9365 70.3142 18.1423 19.2782 2.5222 4.1052 0.5669 9.4015 30.1080 7.2816 0.5571 51.2962 28.3350 0.9018 6.7378 1.4876 30.0804
temp: 298.150 k
press: 1.00000 atm
elementType: 16 8 8 6 6 6 6 6 6 6 6 6 6 6 6 6 6 6 6 6 6 6 6 6 6 6 6 6 6 1 1 1 1 1 1 1 1 1 1 1 1 1 1 1 1
symmnumber: 1
zpe: 885226.7 jmol-1
zpe.correction: 0.337165 hartree
zpe.thermalcorrener: 0.359649 hartree
zpe.thermalcorrenthalpy: 0.360593 hartree
zpe.thermalcorrgfe: 0.284215 hartree
zpe.sumelectzpe: -1546.964119 hartree
zpe.sumelectthermal: -1546.941635 hartree
zpe.sumelectthermalent: -1546.940691 hartree
zpe.sumelectthermalfe: -1547.017069 hartree
dipole: -3.1364 2.5081 -0.9243
dipole: 4.1209
quadrupole: -136.0317 -166.0211 -176.2844
quadrupole: 17.1677 -3.8129 0.5518
quadrupole: 23.4140 -6.5754 -16.8387 17.1677 -3.8129 0.5518
hfenergy: -1547.3012842 hartree
pointgroup: C01 [X(C26H16O2S1)]
dipole: 1.2380096 -1.0378742 -0.1369268 debye
polarizability: 639.7255947|-13.5307517|311.8641191|19.6772469|-46.1133189|153.2532655 unknown
InChI: InChI=1S/C26H16O2S/c1-28-26-19-13-14-21-24-17(16-9-5-6-10-20(16)29-21)11-12-18(23(19)24)25(27)22(26)15-7-3-2-4-8-15/h2-14H,1H3
charge 0 multiplicity 1
45 atoms
S  4.077022 -2.08237 0.658788
O  -2.621783 -2.413122 0.072962
O  -2.125227 2.369206 -0.797947
C  0.394594 -0.25075 -0.05206
C  1.834929 -0.393025 0.084967
C  -0.480196 -1.382967 0.099626
C  2.692498 0.764859 -0.101946
C  -0.176621 1.023264 -0.365292
C  2.325792 -1.709461 0.39842
C  4.177054 0.698475 -0.001196
C  -1.927884 -1.200528 -0.040287
C  -2.526298 0.044121 -0.251524
C  -1.65123 1.214997 -0.500218
C  2.066181 2.001198 -0.397896
C  0.671375 2.130739 -0.527846
C  0.06776 -2.649632 0.38018
C  1.459351 -2.808821 0.536779
C  4.886546 -0.492873 0.331476
C  -3.993447 0.281898 -0.128756
C  4.985933 1.854528 -0.240131
C  6.299604 -0.52725 0.433083
C  6.386089 1.832818 -0.144531
C  7.055558 0.633107 0.198359
C  -4.691634 -0.207972 1.010842
C  -4.710235 1.051762 -1.08351
C  -3.809068 -2.675112 -0.767168
C  -6.06925 0.047593 1.181967
C  -6.090115 1.300279 -0.915911
C  -6.776782 0.799869 0.214946
H  2.666951 2.902203 -0.532186
H  0.21111 3.097129 -0.756794
H  -0.601711 -3.506237 0.483855
H  1.870502 -3.79696 0.76781
H  4.511949 2.79967 -0.512364
H  6.79892 -1.467069 0.693532
H  6.956786 2.746892 -0.337679
H  8.146993 0.602973 0.277224
H  -4.142512 -0.776909 1.770071
H  -4.179767 1.463537 -1.945899
H  -3.773239 -3.756125 -0.977358
H  -3.758313 -2.09583 -1.705441
H  -4.734758 -2.416843 -0.227951
H  -6.586648 -0.332073 2.070514
H  -6.627316 1.893702 -1.664367
H  -7.846163 1.001009 0.34586
