program: Gaussian 09
title: 000118492
version: EM64L-G09RevD.01
frameworkgroup: C1[X(C11H14O2)]
method: RPBEPBE
basis: SDD
operation: Freq
keyword: #pfreq=noraman
keyword: PBEPBE/SDD
title: #p freq=noraman PBEPBE/SDD
converged: YES YES NO NO
title: Mulliken charges:
elementType: O O C C C C C C C C C C C H H H H H H H H H H H H H H
charge: -0.295602 -0.262599 0.371991 0.074302 0.472534 -0.580593 -0.325946 -0.401533 -0.788757 0.175861 -0.808907 -0.218669 -0.675801 0.236318 0.273207 0.234617 0.209500 0.247183 0.247235 0.228174 0.239009 0.226605 0.226697 0.226805 0.210970 0.228775 0.228623
chargesum: 0.00000
title: Mulliken charges with hydrogens summed into heavy atoms:
elementType: O O C C C C C C C C C C C
charge: -0.295602 -0.262599 0.371991 0.074302 0.472534 -0.344274 -0.052739 -0.166916 -0.084840 0.175861 -0.115119 0.234833 -0.007433
polarizability: 1.83244415e+02 -6.92931880e+00 1.37082648e+02 5.03621896e-01 -1.27362361e-01 6.98041800e+01
1716.lowfreq: -18.6154 -6.3855 0.0003 0.0005 0.0008 2.8058 8.6348 34.5540 68.3157
frequency: -18.4424 34.2070 68.1731 74.5478 102.6345 134.7676 172.2864 200.5034 241.5427 245.5439 271.7230 293.8454 313.8784 355.7663 399.6733 442.1260 491.0277 539.4076 554.1055 596.1403 681.7682 718.0460 756.4586 785.1255 800.2779 838.5523 843.3470 891.5052 931.2163 984.8307 987.9192 1016.1482 1026.4282 1042.9482 1043.4043 1048.2417 1111.7930 1136.8320 1145.6424 1174.5611 1232.8118 1248.6565 1249.3142 1290.1948 1358.2292 1375.2229 1393.2318 1396.0530 1401.8440 1409.6113 1453.9587 1463.0132 1464.2153 1471.3081 1473.1023 1474.4418 1487.1983 1493.6276 1566.8566 1608.8527 1622.0170 2975.3476 2990.9168 2994.4511 3006.8253 3057.0978 3063.8683 3076.9468 3087.3669 3089.8293 3090.5569 3105.6280 3117.3976 3130.0898 3177.7310
redmass: 1.0165 3.8106 4.1079 2.3824 3.5968 2.7061 1.1889 2.1608 3.9226 1.2570 3.2427 3.9834 3.5639 6.4215 3.2732 2.8420 3.6045 3.3649 4.9115 5.7202 4.1475 5.6588 3.5547 6.5381 1.1012 3.2987 1.4611 1.2878 3.2636 1.3593 1.5058 2.5957 1.5662 2.5204 2.2751 1.6191 2.2201 1.4692 1.7242 1.6654 3.1583 2.5617 1.1309 1.5497 1.4318 5.5843 1.9268 1.3327 1.2728 1.3393 1.0457 1.2232 1.0404 1.1293 1.0985 1.0629 1.0820 2.3455 6.8359 9.1155 6.5260 1.0389 1.0365 1.0359 1.0582 1.0944 1.1065 1.0959 1.1000 1.1013 1.0984 1.1023 1.0911 1.0903 1.0942
irintensity: 0.4911 0.8802 0.0966 1.5191 1.4462 3.1281 2.3966 1.8846 2.4474 0.2340 0.3701 2.8454 5.0075 8.9301 4.1485 4.8846 1.6715 0.2264 0.7497 2.0363 18.4141 2.8805 9.4389 6.6099 2.1184 2.0919 27.5236 1.3288 6.5549 1.0267 0.4153 31.0770 3.2374 163.7358 184.3287 34.1554 2.9468 5.3803 78.3765 9.4351 328.5786 2.4335 0.0019 1.9619 0.4424 9.7850 7.2674 9.1866 22.5641 17.0781 11.9874 10.3143 11.9539 32.2189 24.5230 2.1992 14.0122 5.6627 51.3654 139.5460 127.1791 28.8367 21.3638 22.9414 23.4091 21.5059 9.7315 10.4546 15.2845 28.2969 30.8309 46.3517 26.2394 15.2647 4.2446
temp: 298.150 k
press: 1.00000 atm
elementType: 8 8 6 6 6 6 6 6 6 6 6 6 6 1 1 1 1 1 1 1 1 1 1 1 1 1 1
symmnumber: 1
zpe: 582550.0 jmol-1
zpe.correction: 0.221882 hartree
zpe.thermalcorrener: 0.234915 hartree
zpe.thermalcorrenthalpy: 0.235860 hartree
zpe.thermalcorrgfe: 0.181739 hartree
zpe.sumelectzpe: -577.062564 hartree
zpe.sumelectthermal: -577.049531 hartree
zpe.sumelectthermalent: -577.048586 hartree
zpe.sumelectthermalfe: -577.102707 hartree
dipole: 0.8264 -1.7544 0.0595
dipole: 1.9402
quadrupole: -60.8002 -77.1381 -79.4129
quadrupole: 3.5601 0.2946 -0.1431
quadrupole: 11.6502 -4.6877 -6.9625 3.5601 0.2946 -0.1431
hfenergy: -577.2844459 hartree
pointgroup: C01 [X(C11H14O2)]
dipole: 0.346504 -0.6783654 0.0495729 debye
polarizability: 183.6246596|-5.4244427|136.5979789|1.3152808|-2.531473|69.9086046 unknown
InChI: InChI=1S/C11H14O2/c1-4-13-11(12)10-6-5-8(2)7-9(10)3/h5-7H,4H2,1-3H3
charge 0 multiplicity 1
27 atoms
O  -2.242565 -0.558175 -0.100337
O  -1.858855 1.733334 -0.164258
C  1.080718 1.165188 -0.149384
C  0.044308 0.174561 -0.114545
C  2.781018 -0.654035 -0.07936
C  2.42498 0.715964 -0.1326
C  0.393655 -1.203966 -0.06698
C  1.737192 -1.614771 -0.051252
C  0.813332 2.657919 -0.207855
C  -1.394298 0.563134 -0.129875
C  4.236899 -1.078921 -0.029373
C  -3.703027 -0.259609 -0.111358
C  -4.427894 -1.601777 -0.082087
H  3.223065 1.468615 -0.163042
H  -0.411684 -1.942494 -0.046389
H  1.981385 -2.683088 -0.017659
H  1.764877 3.216694 -0.236226
H  0.210996 2.928695 -1.0925
H  0.223174 2.998844 0.660765
H  4.887988 -0.36402 -0.562368
H  4.595521 -1.131472 1.017386
H  4.382813 -2.078195 -0.475627
H  -3.939196 0.368705 0.766923
H  -3.934282 0.326629 -1.019552
H  -5.520862 -1.436248 -0.090472
H  -4.162759 -2.212584 -0.962151
H  -4.1702 -2.170227 0.828077
