program: Gaussian 09
title: 000118402
version: EM64L-G09RevD.01
frameworkgroup: C1[X(C18H35ClO)]
method: RPBEPBE
basis: SDD
operation: Freq
keyword: #p
keyword: freq=noraman
keyword: PBEPBE/SDD
title: #p freq=noraman PBEPBE/SDD
converged: YES YES NO NO
title: Mulliken charges:
elementType: Cl O C C C C C C C C C C C C C C C C C C H H H H H H H H H H H H H H H H H H H H H H H H H H H H H H H H H H H
charge: -0.110728 -0.090036 -0.386959 -0.385646 -0.386218 -0.387765 -0.383854 -0.385565 -0.392740 -0.387740 -0.375716 -0.384272 -0.022099 -0.386082 -0.372094 -0.382589 -0.716653 -0.715892 -0.399078 -0.042049 0.193667 0.193869 0.194298 0.192784 0.192555 0.193288 0.194723 0.193909 0.193282 0.191479 0.193114 0.194861 0.203104 0.188062 0.194822 0.195833 0.188010 0.188564 0.194178 0.195207 0.191655 0.197849 0.198480 0.196256 0.195688 0.221167 0.221833 0.202984 0.222399 0.209796 0.205554 0.211309 0.212251 0.268397 0.268551
chargesum: 0.00000
title: Mulliken charges with hydrogens summed into heavy atoms:
elementType: Cl O C C C C C C C C C C C C C C C C C C
charge: -0.110728 -0.090036 0.000577 0.001435 -0.000375 0.000867 0.000906 0.002409 -0.001574 0.002915 0.000858 0.005114 0.169556 0.010247 0.019850 0.060412 -0.081475 -0.086778 0.137869 -0.042049
polarizability: 2.91890678e+02 9.67496532e+00 1.87543000e+02 -4.58927459e-01 -1.94072058e+00 1.57978981e+02
1716.lowfreq: -27.7439 -2.8194 -0.0018 -0.0002 0.0020 2.2999 10.6104 17.1323 23.0560
frequency: -10.8628 15.3228 17.5842 25.0277 27.4086 41.0578 47.1587 65.3140 71.3033 77.0300 87.1634 98.1463 105.7987 114.9214 122.2867 125.7376 137.8826 142.5361 156.8819 158.1088 177.2001 205.9770 213.7486 237.3807 246.4566 292.4880 310.3809 355.5338 375.8727 386.2665 407.8611 416.8025 449.9529 462.8392 471.5852 498.8148 509.3793 704.7337 718.1551 719.9781 721.4275 725.7320 735.3419 752.6010 778.4697 808.1426 819.3933 854.8148 896.8289 912.0636 933.2922 939.0248 945.1984 955.6148 979.8884 982.1529 984.8762 1010.1161 1014.8065 1019.9531 1039.5210 1043.8106 1050.3970 1067.5197 1069.2356 1078.8092 1080.6419 1083.0802 1083.5386 1101.5327 1108.7266 1139.2757 1177.7787 1177.8631 1188.6186 1197.8405 1208.0839 1219.2927 1228.7367 1239.7139 1248.2969 1258.5648 1265.3403 1276.6961 1277.8673 1279.8868 1284.2612 1288.4070 1292.1635 1293.9195 1295.6476 1297.2261 1298.8346 1310.2713 1325.1544 1331.4141 1338.0978 1349.2212 1353.6610 1355.7961 1357.0808 1359.7748 1360.5354 1374.1625 1390.8404 1424.4003 1455.0405 1457.7475 1458.4271 1460.6945 1461.6307 1463.5534 1464.0889 1467.5232 1469.5055 1471.8426 1473.1572 1477.5840 1481.3194 1482.7430 1485.3780 1488.2232 1490.0825 1760.1442 2944.0661 2948.0115 2948.1990 2949.3100 2949.9397 2950.9819 2952.1671 2952.8904 2953.9247 2956.9966 2960.7186 2963.7798 2964.4194 2965.6225 2968.7089 2980.3857 2982.7037 2985.9493 2989.0112 2989.7941 2993.4905 2996.8318 2997.9357 3004.7586 3013.7483 3022.8955 3030.7271 3035.1599 3039.7098 3043.1939 3056.0333 3062.9672 3063.2505 3066.5951 3073.3398
redmass: 2.6273 3.4352 4.1365 4.6709 3.6894 4.6120 3.7283 1.6243 3.3080 4.2218 1.7277 2.8240 5.0259 1.7509 4.0720 2.3950 1.8521 2.0835 2.0119 1.9772 3.8038 4.8776 1.1243 1.8163 1.5508 3.7277 3.4017 3.1775 2.6896 14.0721 2.4541 2.9503 2.6824 2.8550 3.1596 2.9715 2.9967 7.3001 1.0592 1.0696 1.0783 1.0994 1.1344 1.1848 1.2548 1.7417 1.6442 1.2973 1.3025 1.1805 1.5691 5.1058 1.4696 1.5082 5.0138 4.0573 1.3415 4.0228 3.2265 1.2702 3.3815 1.2084 2.5603 3.4898 2.6691 2.3661 2.1131 2.1579 2.2532 3.9221 1.3616 2.4498 1.7561 2.0003 1.6670 1.3070 1.5408 1.3101 1.4230 1.3049 1.3364 1.2945 1.2671 1.2763 1.0854 1.1145 1.0545 1.1103 1.0987 1.2498 1.1426 1.1177 1.1172 1.3609 1.4127 1.4305 1.4543 1.4928 1.7131 1.5508 1.6510 1.6230 1.6025 1.2245 1.2151 1.0778 1.0724 1.0732 1.0755 1.0718 1.0702 1.0784 1.0612 1.0897 1.0509 1.0699 1.0819 1.0984 1.0672 1.0898 1.0993 1.0980 1.0525 10.9717 1.0619 1.0587 1.0587 1.0593 1.0593 1.0601 1.0703 1.0646 1.0609 1.0606 1.0601 1.0545 1.0406 1.0579 1.0363 1.0960 1.0965 1.0973 1.0612 1.0980 1.0996 1.0593 1.1017 1.1035 1.1045 1.1047 1.1034 1.1020 1.1040 1.1043 1.0993 1.1032 1.0990 1.0994 1.0986
irintensity: 0.5832 0.1233 0.1956 0.0207 0.9696 0.5955 1.3457 0.1210 1.0494 0.7613 0.0669 0.7966 0.4252 0.0003 0.6853 0.6153 0.0018 0.2913 0.0004 0.0398 0.5116 2.9579 0.1769 0.0468 0.8297 4.1065 3.0338 3.4197 2.7954 22.6145 0.5329 9.1971 1.2382 0.0302 3.6154 0.9279 2.1838 148.4706 18.9762 0.3839 14.7634 0.1931 2.0725 0.2861 1.4124 0.2095 1.6280 0.8895 1.4307 3.9786 2.5058 105.4636 3.6034 0.1161 1.4292 10.2314 1.2711 3.4297 0.9234 1.5489 10.7675 0.7539 0.2514 2.1527 1.2784 0.1691 0.0437 0.0184 0.0176 2.0457 0.1813 5.2306 17.7051 0.9651 11.1603 37.8120 0.2729 1.5834 1.2314 9.6848 0.3569 3.5888 0.5953 5.3384 0.0449 0.1879 0.2673 0.1347 0.2609 4.0521 0.8623 0.1290 0.1060 0.7623 6.6903 3.3847 0.1239 3.2181 0.0079 0.8472 0.5093 0.3438 0.9295 18.3489 14.9319 33.8980 0.4183 0.0043 0.1321 0.0821 0.0930 0.3535 0.1740 0.6155 1.3318 2.4503 4.0627 0.6895 5.8131 6.0770 4.8193 28.3341 35.0602 239.8219 8.8770 0.0337 0.1015 0.3635 0.2792 0.3652 9.8723 2.7842 3.2696 1.6356 1.1886 12.3733 17.3071 415.4538 29.3135 0.0469 0.6581 0.3961 12.5437 3.7674 2.2477 28.0288 4.5722 0.6878 3.0395 0.8217 6.8597 0.4654 4.3183 391.2941 7.9326 64.0690 105.1410 64.2628 57.8394
temp: 298.150 k
press: 1.00000 atm
elementType: 17 8 6 6 6 6 6 6 6 6 6 6 6 6 6 6 6 6 6 6 1 1 1 1 1 1 1 1 1 1 1 1 1 1 1 1 1 1 1 1 1 1 1 1 1 1 1 1 1 1 1 1 1 1 1
symmnumber: 1
zpe: 1291765.1 jmol-1
zpe.correction: 0.492007 hartree
zpe.thermalcorrener: 0.518076 hartree
zpe.thermalcorrenthalpy: 0.519020 hartree
zpe.thermalcorrgfe: 0.430553 hartree
zpe.sumelectzpe: -1240.553217 hartree
zpe.sumelectthermal: -1240.527148 hartree
zpe.sumelectthermalent: -1240.526204 hartree
zpe.sumelectthermalfe: -1240.614672 hartree
dipole: -3.9061 1.1373 -0.2694
dipole: 4.0772
quadrupole: -204.1271 -139.6975 -132.1220
quadrupole: 10.0284 -1.0202 1.0433
quadrupole: -45.4782 18.9513 26.5268 10.0284 -1.0202 1.0433
hfenergy: -1241.0452244 hartree
pointgroup: C01 [X(C18H35Cl1O1)]
dipole: 1.5439244 -0.4256429 -0.0909559 debye
polarizability: 291.5453325|11.3885989|187.987988|0.0433077|0.8980709|157.8793388 unknown
InChI: InChI=1S/C18H35ClO/c1-17(2)15-13-11-9-7-5-3-4-6-8-10-12-14-16-18(19)20/h17H,3-16H2,1-2H3
charge 0 multiplicity 1
55 atoms
Cl -11.150948 -1.147045 0.070155
O  -9.895338 1.292529 0.165678
C  3.199907 0.49291 0.057825
C  1.922171 -0.338102 -0.195911
C  4.503884 -0.297825 -0.191813
C  0.6162 0.456688 0.029036
C  5.783161 0.522282 0.088408
C  -0.658235 -0.394877 -0.166826
C  7.086404 -0.266622 -0.173316
C  -1.967548 0.406405 0.010557
C  8.360916 0.55563 0.124862
C  -3.236532 -0.468492 -0.101602
C  9.695838 -0.152077 -0.232947
C  -4.549117 0.337925 0.018798
C  -5.812588 -0.550598 -0.033032
C  -7.122287 0.264438 0.053735
C  9.921934 -1.432502 0.607703
C  10.886843 0.821227 -0.062774
C  -8.3621 -0.654081 0.025574
C  -9.672969 0.092191 0.097675
H  3.191975 0.865274 1.10382
H  3.187726 1.393459 -0.591653
H  1.938485 -0.72809 -1.235353
H  1.928125 -1.227859 0.468566
H  4.506919 -1.208262 0.443948
H  4.520133 -0.654397 -1.243237
H  0.590645 1.323299 -0.66467
H  0.617439 0.881069 1.055025
H  5.771424 0.87003 1.14291
H  5.776923 1.438095 -0.539474
H  -0.645174 -1.239692 0.553785
H  -0.643023 -0.851217 -1.178868
H  7.077571 -1.188188 0.443078
H  7.105744 -0.59926 -1.232866
H  -1.957957 0.911085 0.999373
H  -2.008654 1.214229 -0.749834
H  8.378864 0.830205 1.20155
H  8.3061 1.511211 -0.438409
H  -3.210882 -1.248561 0.687977
H  -3.225543 -1.008152 -1.071775
H  9.643689 -0.448464 -1.303206
H  -4.542584 0.910705 0.969435
H  -4.593759 1.089104 -0.79693
H  -5.804998 -1.142432 -0.972156
H  -5.775392 -1.284207 0.799195
H  -7.128515 0.867549 0.981901
H  -7.173457 0.983347 -0.786285
H  9.940198 -1.18764 1.687948
H  9.126947 -2.181812 0.442822
H  10.888392 -1.906619 0.353243
H  10.975778 1.14791 0.991788
H  11.841922 0.34169 -0.348192
H  10.759122 1.725828 -0.686694
H  -8.386758 -1.273603 -0.892765
H  -8.348823 -1.378735 0.863416
