program: Gaussian 09
title: 000118399
version: EM64L-G09RevD.01
frameworkgroup: C1[X(C11H13ClO2)]
method: RPBEPBE
basis: SDD
operation: Freq
keyword: #p
keyword: freq=noraman
keyword: PBEPBE/SDD
title: #p freq=noraman PBEPBE/SDD
converged: NO YES NO NO
title: Mulliken charges:
elementType: Cl O O C C C C C C C C C C C H H H H H H H H H H H H H
charge: -0.024298 -0.229968 -0.122301 0.130769 0.507462 -0.694445 -0.693209 -0.744828 -0.373407 -0.393106 -0.380334 -0.367177 0.388121 0.039750 0.212112 0.214400 0.224663 0.215199 0.211591 0.226442 0.221067 0.216900 0.218411 0.236347 0.256096 0.252002 0.251743
chargesum: 0.00000
title: Mulliken charges with hydrogens summed into heavy atoms:
elementType: Cl O O C C C C C C C C C C C
charge: -0.024298 -0.229968 -0.122301 0.130769 0.507462 -0.043270 -0.039977 -0.088451 -0.137060 -0.137010 -0.128332 -0.115435 0.388121 0.039750
polarizability: 1.97812140e+02 -6.58195419e-01 1.13711411e+02 8.82949154e+00 9.34655770e-02 9.19189876e+01
1716.lowfreq: -33.4053 -12.6328 -2.5861 -0.0005 0.0004 0.0016 7.4843 43.7378 50.1448
frequency: -33.3989 43.1076 50.1402 53.3304 124.6930 199.4014 205.0726 212.5094 255.5362 258.4918 305.0873 312.2996 347.8828 358.6751 384.5576 411.3096 414.7439 433.4532 461.8201 510.6018 546.2700 604.0861 631.8883 643.1085 715.7098 766.3524 779.0730 829.6849 836.6621 853.4097 919.9948 932.6307 943.7258 957.4397 970.1397 1003.2551 1018.7217 1023.0427 1026.0741 1108.1697 1114.8092 1139.3825 1193.6679 1204.1706 1215.2144 1271.5781 1301.7838 1370.2434 1377.1401 1380.1428 1401.0371 1407.7960 1461.7468 1465.6540 1467.1509 1479.6650 1489.1049 1491.4069 1499.3882 1598.4880 1605.8118 1708.7240 2974.5112 2975.9259 2980.8243 3070.5849 3071.8538 3072.0252 3079.5071 3080.5635 3083.2639 3139.5361 3155.9736 3166.9589 3177.8126
redmass: 7.2584 4.1788 9.0781 4.2774 4.8630 4.2824 1.3114 3.1937 2.7831 1.1178 2.7864 1.0596 3.1260 2.8708 4.3828 3.0119 6.5174 5.3146 3.0515 3.4303 2.6788 12.1275 7.3745 5.0790 3.8406 4.8747 5.9151 1.2488 2.7344 1.8822 1.7500 1.6351 1.2259 1.3489 1.3692 3.2956 3.0680 2.0974 1.3840 2.2996 1.3893 2.8259 1.2402 2.9467 2.6721 3.1509 1.2725 5.8928 1.2206 1.2666 2.9978 1.2076 1.0506 1.0479 1.0956 1.1465 1.0635 1.6417 1.1492 7.5477 6.3471 13.0700 1.0353 1.0346 1.0359 1.1005 1.1000 1.1000 1.0994 1.0989 1.0990 1.0881 1.0888 1.0962 1.0958
irintensity: 0.3290 0.1400 0.0811 0.1239 1.0529 0.6497 1.0729 0.9487 1.0119 0.4405 0.9572 0.0301 1.0290 4.6563 1.3517 0.0193 1.2098 15.4071 0.6290 14.0203 34.2837 8.4908 0.4056 17.0481 47.2455 47.0352 7.0742 0.0332 4.1999 66.7175 3.8060 2.2640 0.5302 1.8005 0.0407 195.9205 438.5022 160.9298 0.1353 4.0597 10.9092 112.2188 7.8343 6.0246 1.9875 35.2805 0.4941 0.0663 19.3065 18.7083 10.2057 10.3345 0.0940 0.6237 5.1070 25.5967 11.2876 37.9325 58.6558 2.9217 6.1774 307.6154 30.0206 31.4893 24.3557 8.5072 10.6865 4.8837 51.7549 93.3834 50.6065 13.7651 4.5706 6.7267 3.9038
temp: 298.150 k
press: 1.00000 atm
elementType: 17 8 8 6 6 6 6 6 6 6 6 6 6 6 1 1 1 1 1 1 1 1 1 1 1 1 1
symmnumber: 1
zpe: 557014.8 jmol-1
zpe.correction: 0.212156 hartree
zpe.thermalcorrener: 0.225706 hartree
zpe.thermalcorrenthalpy: 0.226650 hartree
zpe.thermalcorrgfe: 0.171353 hartree
zpe.sumelectzpe: -1036.426964 hartree
zpe.sumelectthermal: -1036.413413 hartree
zpe.sumelectthermalent: -1036.412469 hartree
zpe.sumelectthermalfe: -1036.467767 hartree
dipole: 4.4801 0.0229 -0.8565
dipole: 4.5613
quadrupole: -94.0708 -82.3367 -97.7220
quadrupole: -0.0389 3.1372 0.1834
quadrupole: -2.6943 9.0398 -6.3455 -0.0389 3.1372 0.1834
hfenergy: -1036.6391194 hartree
pointgroup: C01 [X(C11H13Cl1O2)]
dipole: -1.7707082 0.0100807 0.2914249 debye
polarizability: 197.2874433|0.1495067|113.7050095|11.5641751|0.2682645|92.450086 unknown
InChI: InChI=1S/C11H13ClO2/c1-11(2,3)8-4-6-9(7-5-8)14-10(12)13/h4-7H,1-3H3
charge 0 multiplicity 1
27 atoms
Cl 5.289659 -0.034073 0.355304
O  2.710501 -0.013772 0.75275
O  3.314785 -0.011012 -1.529065
C  -3.044136 0.011361 -0.162089
C  -1.514598 0.036625 0.06776
C  -3.730408 -0.751541 1.011566
C  -3.347364 -0.724675 -1.502734
C  -3.653826 1.434693 -0.239045
C  -0.798018 -1.188918 0.165595
C  -0.777205 1.242775 0.18527
C  0.596849 -1.218976 0.365022
C  0.622544 1.237864 0.385382
C  1.282111 0.003663 0.465477
C  3.567418 -0.019899 -0.327744
H  -4.82473 -0.782182 0.854722
H  -3.371856 -1.793385 1.090012
H  -3.53268 -0.251125 1.97707
H  -2.969678 -1.762799 -1.494768
H  -4.43891 -0.762797 -1.676103
H  -2.878642 -0.20057 -2.3554
H  -4.744118 1.359955 -0.402606
H  -3.4964 2.00191 0.697135
H  -3.231344 2.018167 -1.077877
H  -1.333014 -2.141219 0.084951
H  -1.287687 2.207041 0.121023
H  1.140736 -2.165282 0.443684
H  1.185112 2.171872 0.479508
