program: Gaussian 09
title: 000118393
version: EM64L-G09RevD.01
frameworkgroup: C1[X(C21H26O3)]
method: RPBEPBE
basis: SDD
operation: Freq
keyword: #pfreq=noraman
keyword: PBEPBE/SDD
title: #p freq=noraman PBEPBE/SDD
converged: YES YES NO NO
title: Mulliken charges:
elementType: O O O C C C C C C C C C C C C C C C C C C C C C H H H H H H H H H H H H H H H H H H H H H H H H H H
charge: -0.250585 -0.399748 -0.334500 -0.391594 -0.398455 -0.031926 -0.364642 -0.407206 -0.715212 -0.714549 -0.319392 0.398317 -0.539352 -0.389996 0.135113 0.175215 -0.341004 0.098543 0.306719 -0.387273 -0.359548 -0.236315 -0.229596 -0.230163 0.192274 0.193116 0.208213 0.207316 0.198211 0.188878 0.190368 0.217355 0.217990 0.212193 0.213253 0.211560 0.211637 0.212370 0.212277 0.211377 0.211361 0.279714 0.252059 0.265101 0.271845 0.267845 0.381892 0.232192 0.233245 0.233506
chargesum: 0.00000
title: Mulliken charges with hydrogens summed into heavy atoms:
elementType: O O O C C C C C C C C C C C C C C C C C C C C C
charge: -0.250585 -0.017856 -0.334500 -0.006205 0.017075 0.166285 0.014605 0.028139 -0.078206 -0.078266 0.103346 0.398317 -0.259638 -0.137936 0.135113 0.175215 -0.075903 0.098543 0.306719 -0.115428 -0.091703 -0.004123 0.003649 0.003343
polarizability: 3.87927119e+02 -2.54579879e+01 2.41654958e+02 1.67118951e+01 4.83140327e+00 1.51524150e+02
1716.lowfreq: -4.3371 -1.4824 -0.0012 0.0009 0.0015 5.5304 8.9569 18.8499 26.3652
frequency: 6.7249 18.4720 26.1364 41.7780 53.0504 59.5937 75.3268 84.8044 99.6097 109.0268 129.5686 140.8521 151.9845 155.3524 191.3981 208.9303 221.3848 235.4489 237.3152 257.7211 270.4938 300.7909 308.7177 354.8646 366.2618 391.3930 405.0474 416.0968 433.1324 449.7195 461.2012 518.8441 535.9719 556.0134 583.6927 613.8723 625.0240 631.9099 672.9920 693.8643 705.2619 730.2254 734.8584 744.2614 762.6713 787.0908 787.2662 804.9281 835.9163 860.0880 869.8660 881.3565 909.3577 929.0658 936.9558 939.3431 948.0028 957.0833 961.3116 963.0223 977.6758 986.0694 989.2352 990.5566 1002.3855 1027.4214 1036.2411 1045.1436 1063.8729 1084.2954 1088.8281 1121.1514 1134.5328 1145.9746 1159.7495 1174.8744 1180.5116 1183.2337 1191.4389 1191.7550 1231.1516 1233.7195 1240.0606 1277.5554 1280.3349 1287.9417 1289.4204 1296.3336 1305.6522 1317.2539 1322.7446 1334.9072 1348.8658 1353.6233 1364.2886 1376.1884 1376.7453 1380.9537 1394.5014 1401.6483 1415.4973 1435.2262 1456.8746 1464.6106 1466.7575 1468.8250 1476.6601 1477.0477 1479.8967 1483.7677 1486.8826 1489.3748 1491.0263 1530.2234 1566.3881 1585.1293 1608.7748 1644.3233 2695.4680 2944.4086 2952.7380 2956.8134 2963.0941 2968.7952 2973.0957 2976.7890 2994.7956 2996.2421 3001.8204 3014.7453 3040.3900 3063.3886 3063.6719 3066.0875 3068.1012 3071.1238 3129.1947 3139.1717 3149.9394 3154.0179 3161.1367 3171.3022 3176.6032 3188.6161
redmass: 3.2581 4.0691 4.5195 3.7075 4.4690 4.3299 3.7813 1.7763 3.7260 3.8691 3.2567 2.2538 2.7327 4.3058 4.5936 4.0136 1.1417 1.1927 3.8755 5.6338 4.9084 5.8057 3.9695 2.0074 2.4606 5.1667 2.8524 4.1360 4.2824 4.7384 3.1482 5.8927 4.2648 2.8071 5.6733 6.4477 5.7940 5.4963 3.4554 4.9821 1.7495 1.0841 6.8782 2.8268 1.1464 1.6670 3.0007 2.2564 1.2344 1.2496 1.6241 5.3930 1.1909 3.3966 1.3142 1.6946 2.2587 1.3006 1.4311 1.1065 2.6893 1.5266 4.2031 2.5462 1.3350 2.2437 1.4316 3.2606 2.6144 1.5941 2.1813 2.4736 2.2344 1.4384 2.0534 1.0548 1.6150 1.6864 1.8549 1.2571 1.3252 1.9264 1.3010 2.7291 1.1406 1.0934 1.4682 1.1168 2.1272 1.4214 1.4515 1.4428 1.4244 3.4805 1.5001 1.6057 1.2183 8.0444 1.2239 3.2841 4.7266 2.3465 1.0759 1.0453 1.0725 1.1122 1.2604 1.3472 1.4171 1.0619 1.8079 1.1889 1.2127 4.4816 2.9397 5.9271 6.0423 5.1904 1.0721 1.0659 1.0571 1.0576 1.0717 1.0351 1.0445 1.0543 1.0968 1.0603 1.1018 1.1064 1.1049 1.1004 1.1007 1.1039 1.0989 1.0986 1.0851 1.0883 1.0915 1.0893 1.0960 1.1008 1.0957 1.0926
irintensity: 0.0299 0.3481 0.2479 0.0506 0.1886 0.3564 0.3074 0.0144 0.1930 0.5250 1.8010 0.1556 1.6021 0.7322 0.1640 0.3192 0.0152 0.2762 0.6856 1.3023 4.0416 2.2578 2.1230 0.0015 0.0003 3.4816 0.7060 6.1455 11.4722 3.7061 4.9458 0.8902 2.3435 4.2974 4.9024 1.3481 22.4254 64.6551 15.3923 11.6103 56.6670 9.7371 5.8598 22.0159 1.1931 12.9449 0.3254 33.0238 0.1696 4.3637 52.8638 23.8467 2.4361 8.3732 0.6015 3.7036 0.3421 8.5011 2.5795 115.1479 38.1415 8.9760 2.7545 100.9658 0.8635 8.5033 0.4479 2.6422 2.4922 16.9131 2.0150 158.3877 0.5194 0.1629 245.2909 0.1501 2.7860 27.5905 13.2430 14.3713 34.1371 22.1359 0.2189 364.3136 0.7447 0.5606 8.6203 1.0014 226.7530 20.3034 4.4551 3.3532 1.4717 339.1689 2.5689 12.6895 22.4319 6.2065 14.4102 122.7272 0.2661 45.0948 3.1317 1.6810 0.3484 17.5551 34.2562 38.4853 0.6388 11.9262 37.8860 7.0271 63.2489 72.3803 147.2513 2.6708 20.0128 582.8615 389.0292 13.8009 7.7835 30.9234 64.6078 43.7399 9.2682 48.3368 15.3748 36.3853 0.8049 19.6287 44.8864 31.3499 2.6124 91.2079 69.4262 115.0035 0.5136 6.0913 25.6815 2.1972 15.5069 20.8783 9.7124 0.5402
temp: 298.150 k
press: 1.00000 atm
elementType: 8 8 8 6 6 6 6 6 6 6 6 6 6 6 6 6 6 6 6 6 6 6 6 6 1 1 1 1 1 1 1 1 1 1 1 1 1 1 1 1 1 1 1 1 1 1 1 1 1 1
symmnumber: 1
zpe: 1097214.8 jmol-1
zpe.correction: 0.417907 hartree
zpe.thermalcorrener: 0.442049 hartree
zpe.thermalcorrenthalpy: 0.442993 hartree
zpe.thermalcorrgfe: 0.360078 hartree
zpe.sumelectzpe: -1039.728591 hartree
zpe.sumelectthermal: -1039.704450 hartree
zpe.sumelectthermalent: -1039.703505 hartree
zpe.sumelectthermalfe: -1039.786420 hartree
dipole: -2.8146 -5.8700 0.5798
dipole: 6.5356
quadrupole: -132.2253 -149.3545 -145.2647
quadrupole: -18.5079 3.8931 3.1001
quadrupole: 10.0562 -7.0730 -2.9832 -18.5079 3.8931 3.1001
hfenergy: -1040.1464982 hartree
pointgroup: C01 [X(C21H26O3)]
dipole: -1.0922994 -1.7443283 1.5413824 debye
polarizability: 388.1166715|-9.3697844|214.9916635|28.7385397|-41.1035629|177.9978917 unknown
InChI: InChI=1S/C21H26O3/c1-16(2)9-5-4-8-14-24-18-12-13-19(20(22)15-18)21(23)17-10-6-3-7-11-17/h3,6-7,10-13,15-16,22H,4-5,8-9,14H2,1-2H3
charge 0 multiplicity 1
50 atoms
O  -1.482286 0.767027 -0.93573
O  2.751822 2.436006 -2.316741
O  4.858518 1.598728 -1.235579
C  -7.282615 -1.118073 0.804384
C  -6.270369 -0.286437 -0.01783
C  -8.785821 -0.839328 0.510469
C  -4.803703 -0.607743 0.351674
C  -3.791315 0.221369 -0.471982
C  -9.171847 -1.181408 -0.94939
C  -9.194115 0.611607 0.864522
C  -2.344238 -0.080414 -0.080278
C  -0.100204 0.688251 -0.781122
C  0.65065 1.543904 -1.612206
C  0.548876 -0.170512 0.160774
C  2.747727 0.646646 -0.624902
C  2.057391 1.552696 -1.528212
C  1.94689 -0.176607 0.222411
C  4.21293 0.665139 -0.595496
C  5.030194 -0.355714 0.134347
C  4.700598 -1.738268 0.144728
C  6.232594 0.074329 0.757371
C  5.5483 -2.666308 0.788235
C  7.067101 -0.851247 1.415481
C  6.725681 -2.225127 1.435393
H  -7.094575 -0.938631 1.884182
H  -7.081563 -2.19609 0.628299
H  -6.417256 -0.473823 -1.100123
H  -6.449942 0.795234 0.143003
H  -9.364387 -1.517437 1.173967
H  -4.651861 -0.416449 1.434884
H  -4.616712 -1.691027 0.195729
H  -3.982421 1.301949 -0.327343
H  -3.921103 0.01377 -1.551247
H  -10.262907 -1.08191 -1.100771
H  -8.674533 -0.50245 -1.667024
H  -8.886323 -2.218544 -1.208384
H  -8.923544 0.862027 1.907759
H  -10.285823 0.750302 0.754403
H  -8.698555 1.343446 0.199582
H  -2.160289 0.165164 0.985856
H  -2.096925 -1.148313 -0.251544
H  0.146496 2.218858 -2.307262
H  -0.027479 -0.806834 0.836415
H  2.440306 -0.808637 0.966514
H  3.812093 -2.092899 -0.387771
H  6.496841 1.135477 0.707902
H  3.75528 2.338918 -2.055997
H  5.295992 -3.732308 0.775203
H  7.98468 -0.50696 1.904709
H  7.378552 -2.946647 1.939135
