program: Gaussian 09
title: 000118389
version: EM64L-G09RevD.01
frameworkgroup: C1[X(C8H18N2)]
method: RPBEPBE
basis: SDD
operation: Freq
keyword: #pfreq=noraman
keyword: PBEPBE/SDD
title: #p freq=noraman PBEPBE/SDD
converged: YES YES NO NO
title: Mulliken charges:
elementType: N N C C C C C C C C H H H H H H H H H H H H H H H H H H
charge: -0.368508 -0.020530 0.316149 -0.733892 -0.692952 -0.692108 0.140850 -0.465484 -0.810182 -0.674779 0.230776 0.216992 0.200967 0.248328 0.217017 0.192253 0.197562 0.203543 0.243386 0.263229 0.230998 0.200153 0.223485 0.240382 0.240291 0.209239 0.225794 0.217038
chargesum: 0.00000
title: Mulliken charges with hydrogens summed into heavy atoms:
elementType: N N C C C C C C C C
charge: -0.105279 -0.020530 0.316149 -0.085156 -0.035353 -0.047617 0.140850 -0.034333 -0.106024 -0.022707
polarizability: 1.43463232e+02 1.24211693e+00 9.54021845e+01 -1.07191339e+00 2.31934354e+00 8.52942133e+01
1716.lowfreq: -14.8989 -9.1266 -0.0007 -0.0006 -0.0006 5.4482 42.4996 54.3486 98.0781
frequency: 42.4227 54.2761 98.0775 123.8830 145.5952 175.1487 201.4761 217.2490 238.5692 243.7734 248.8562 296.3678 323.1191 362.1516 371.5313 417.9631 448.3708 470.0101 537.8928 552.0208 577.5262 746.6949 782.6365 801.2756 905.2101 924.8679 933.6053 945.8301 952.3442 990.8136 1005.3776 1022.8063 1030.8898 1054.3537 1068.9940 1147.4987 1219.2647 1239.2345 1242.4531 1258.4897 1283.3639 1324.9507 1364.9182 1372.9885 1377.1974 1384.9017 1394.7062 1444.4095 1448.1917 1457.0708 1463.5975 1465.0116 1468.4583 1471.7712 1474.0262 1478.5082 1483.7670 1490.6084 1499.3185 1595.5495 2940.9822 2959.7957 2969.4603 2973.6208 2976.6507 2988.2330 3008.8456 3050.6062 3061.9945 3069.0488 3074.0501 3082.3105 3084.6469 3087.4846 3092.8977 3093.9547 3103.3195 3373.0654
redmass: 2.6065 2.7632 2.9854 2.2766 1.2788 1.0225 1.4883 1.4581 1.8114 1.1322 1.1922 2.3408 2.5982 2.5429 2.2395 2.1940 1.5590 3.0508 3.7052 2.5598 2.6696 3.3550 1.3054 2.3456 1.7077 1.7439 1.9584 1.2099 1.6896 1.3935 1.8977 1.4065 1.6985 1.9457 1.8432 2.9252 2.5658 2.4274 2.1397 1.7042 1.9801 2.0564 1.2165 1.2155 1.2469 1.2025 1.2225 1.1117 1.0676 1.0896 1.0508 1.0489 1.0496 1.0633 1.0658 1.0437 1.0693 1.1236 1.0935 8.0130 1.0409 1.0658 1.0371 1.0363 1.0351 1.0356 1.0953 1.0950 1.0975 1.0980 1.0985 1.1009 1.1001 1.1001 1.0952 1.0992 1.0993 1.0740
irintensity: 0.4534 0.3914 1.4435 1.5867 5.0689 0.0522 0.3474 3.6947 3.4757 0.9243 0.6714 1.3140 2.0876 10.7245 9.3202 12.2288 27.0626 9.1662 7.0891 32.4687 31.1457 0.3896 6.6953 0.4258 1.0948 6.6020 10.5196 0.3182 4.3495 4.1121 6.4973 3.9155 1.4794 17.9948 15.6598 100.7944 65.5577 64.5586 21.1483 14.9041 6.5197 1.0732 28.7087 29.6223 25.9557 17.8609 26.5673 12.0434 5.0297 15.1393 1.1434 4.2032 0.3413 9.8208 10.5557 15.3159 13.1271 5.3680 9.7342 8.2136 26.6452 46.8406 23.5922 38.4016 45.9499 25.6215 25.9701 1.3304 6.7986 69.2826 63.9519 43.5622 15.5615 12.3618 35.2304 60.7890 27.9372 4.7052
temp: 298.150 k
press: 1.00000 atm
elementType: 7 7 6 6 6 6 6 6 6 6 1 1 1 1 1 1 1 1 1 1 1 1 1 1 1 1 1 1
symmnumber: 1
zpe: 652881.1 jmol-1
zpe.correction: 0.248669 hartree
zpe.thermalcorrener: 0.262209 hartree
zpe.thermalcorrenthalpy: 0.263153 hartree
zpe.thermalcorrgfe: 0.209352 hartree
zpe.sumelectzpe: -424.285469 hartree
zpe.sumelectthermal: -424.271929 hartree
zpe.sumelectthermalent: -424.270985 hartree
zpe.sumelectthermalfe: -424.324786 hartree
dipole: -0.0028 1.4290 1.1763
dipole: 1.8509
quadrupole: -59.5738 -62.9982 -65.8893
quadrupole: 0.9586 -1.0929 1.0391
quadrupole: 3.2466 -0.1777 -3.0689 0.9586 -1.0929 1.0391
hfenergy: -424.5341383 hartree
pointgroup: C01 [X(C8H18N2)]
dipole: -0.0145741 -0.4329607 -0.5853351 debye
polarizability: 143.4758043|-0.5515181|93.6800304|-1.2699291|4.4593933|87.0037956 unknown
InChI: InChI=1S/C8H18N2/c1-6-7(2)9-10-8(3,4)5/h10H,6H2,1-5H3
charge 0 multiplicity 1
28 atoms
N  -0.743436 -0.617393 0.010075
N  0.368967 0.120059 0.398385
C  -2.051867 0.103181 0.039493
C  -3.126313 -0.931087 -0.368657
C  -2.306313 0.607656 1.478865
C  -2.04367 1.299673 -0.953074
C  1.57548 -0.354051 0.149938
C  2.758315 0.469386 0.624068
C  1.825126 -1.674614 -0.563597
C  3.61597 1.035864 -0.538146
H  -3.130435 -1.786513 0.33047
H  -4.127085 -0.464869 -0.356452
H  -2.949187 -1.315427 -1.392951
H  -1.487418 1.276411 1.791758
H  -2.344791 -0.242373 2.183045
H  -3.262989 1.158716 1.530799
H  -1.889978 0.950227 -1.992083
H  -2.999593 1.853757 -0.913648
H  -1.222979 1.990811 -0.69307
H  -0.638373 -1.291049 -0.764877
H  2.369844 1.299204 1.241085
H  3.406398 -0.153297 1.276408
H  1.482298 -1.65511 -1.620543
H  2.898428 -1.924445 -0.572452
H  1.281392 -2.501632 -0.06198
H  3.999039 0.22858 -1.190104
H  3.017737 1.722387 -1.163926
H  4.486532 1.594548 -0.14753
