program: Gaussian 09
title: 000118274
version: EM64L-G09RevD.01
frameworkgroup: C1[X(C10H9Br5O)]
method: RPBEPBE
basis: SDD
operation: Freq
keyword: #p
keyword: freq=noraman
keyword: PBEPBE/SDD
title: #p freq=noraman PBEPBE/SDD
converged: YES YES NO NO
title: Mulliken charges:
elementType: Br Br Br Br Br O C C C C C C C C C C H H H H H H H H H
charge: 0.009896 -0.034012 0.082863 0.079664 0.047444 -0.268269 -0.154397 -0.236557 -0.665578 -0.641001 0.578512 -0.365970 -0.359068 -0.141069 -0.143063 -0.238108 0.245378 0.251812 0.312201 0.339494 0.243001 0.246432 0.255818 0.277688 0.276890
chargesum: 0.00000
title: Mulliken charges with hydrogens summed into heavy atoms:
elementType: Br Br Br Br Br O C C C C C C C C C C
charge: 0.009896 -0.034012 0.082863 0.079664 0.047444 -0.268269 -0.154397 0.260633 -0.013883 0.104250 0.578512 -0.365970 -0.359068 0.136618 0.133827 -0.238108
polarizability: 2.46241948e+02 -2.03984981e+00 2.40929769e+02 5.25498788e+00 -7.40062987e+00 1.07602509e+02
1716.lowfreq: -5.1975 0.0002 0.0004 0.0004 3.5883 5.3045 11.4146 22.3809 33.2558
frequency: 11.3103 22.3268 33.2364 49.9320 71.4243 91.7062 111.9610 119.8783 132.4068 142.8374 168.8677 176.3113 184.3224 221.4480 228.9959 239.9053 269.0946 273.1447 313.7246 347.7213 349.8074 406.3528 455.7026 499.2747 505.9753 521.5770 562.1918 597.6729 660.6546 707.1534 729.9160 800.8855 827.6815 864.3196 866.6532 875.7417 928.7405 972.2026 990.3929 1030.6033 1052.0795 1091.2710 1096.0529 1183.8142 1187.5000 1214.5286 1243.1275 1246.5056 1275.5573 1327.9708 1356.7953 1362.2114 1395.0600 1413.6566 1432.6356 1449.8167 1465.3746 1470.4484 1533.7184 1555.7840 2973.3056 2993.4042 3056.0814 3081.5893 3089.2807 3110.2291 3176.4765 3184.4445 3186.4368
redmass: 30.9300 30.8149 28.3931 23.8564 32.5919 8.7465 38.7333 20.9745 4.1386 6.3846 9.3663 4.6449 4.6699 53.1267 1.2133 4.8661 3.8836 2.7444 4.2215 4.1751 6.3596 5.2768 3.7148 4.9897 4.2197 6.9089 3.8733 4.2073 9.3134 10.0325 6.7812 5.8025 3.7412 1.5791 1.4679 1.3661 2.5225 2.1643 1.7391 5.5802 1.8109 1.3792 2.4151 1.6414 1.5826 3.0806 1.2855 1.3702 2.2972 4.7183 3.7261 1.5729 1.2174 2.3273 1.1127 1.0893 1.0613 1.0501 9.5033 7.6560 1.0591 1.0368 1.1029 1.0563 1.0974 1.1009 1.1124 1.0930 1.0938
irintensity: 0.0624 0.0740 0.0712 0.6451 0.1669 0.2899 0.0366 0.0990 0.4094 3.2988 2.0085 0.5990 6.6551 0.0761 0.2338 0.4788 4.3676 1.6227 4.7840 1.6407 4.3092 1.7154 2.2226 0.2659 55.2000 15.9689 9.1354 15.9547 58.9523 55.2897 25.7679 9.8544 3.2544 18.6788 21.5047 0.2265 29.4203 27.3621 36.1494 35.5544 29.7185 14.0485 11.2342 12.0243 12.6211 152.1174 15.6994 1.4317 4.3309 19.2214 24.7959 41.4997 53.1864 202.8044 11.0871 4.1011 12.1141 11.1967 58.0908 45.5022 22.0752 12.8459 6.9549 4.1097 10.7829 13.8707 0.2082 0.6710 0.2028
temp: 298.150 k
press: 1.00000 atm
elementType: 35 35 35 35 35 8 6 6 6 6 6 6 6 6 6 6 1 1 1 1 1 1 1 1 1
symmnumber: 1
zpe: 428078.9 jmol-1
zpe.correction: 0.163047 hartree
zpe.thermalcorrener: 0.181701 hartree
zpe.thermalcorrenthalpy: 0.182645 hartree
zpe.thermalcorrgfe: 0.110012 hartree
zpe.sumelectzpe: -527.773378 hartree
zpe.sumelectthermal: -527.754724 hartree
zpe.sumelectthermalent: -527.753780 hartree
zpe.sumelectthermalfe: -527.826413 hartree
dipole: 0.1096 0.5108 2.1275
dipole: 2.1907
quadrupole: -138.8717 -143.7977 -140.2302
quadrupole: -2.5411 -3.1920 3.7276
quadrupole: 2.0948 -2.8312 0.7364 -2.5411 -3.1920 3.7276
hfenergy: -527.9364246 hartree
pointgroup: C01 [X(C10H9Br5O1)]
dipole: 0.0071152 -0.2007899 -0.8381423 debye
dipolederiv: -0.167404 -0.0166537 0.0326419 -0.0199377 -0.6010207 0.285896 0.0628 0.1587995 -0.3115343 -0.1799693 0.0730046 -0.003263 0.0813901 -0.6072672 0.1179086 -0.0306078 0.1749832 -0.1943466 -0.1773127 0.2530531 0.0802272 0.2838595 -0.4073721 -0.1203664 0.0771477 -0.1002534 -0.0181238 -0.143994 -0.2021503 -0.0069507 -0.2172804 -0.517504 -0.0304918 -0.0301142 -0.0364109 0.0079475 -0.7613599 -0.0607407 0.0755269 -0.0633642 -0.0608254 -0.0017901 0.0921365 -0.0009702 -0.0174823 -1.6820169 -0.1148691 -0.1945362 -0.231943 -0.2899958 -0.0381237 -0.188764 -0.0409132 -0.2741006 0.28231 -0.0018445 -0.0259266 0.1300449 0.6076066 -0.3684747 -0.2224215 -0.1986557 0.4212285 0.7286551 0.0975626 0.1941017 0.0923622 0.1203475 0.095353 0.6451842 0.0946338 0.2570291 -0.0179629 -0.0805013 0.0103198 -0.1492532 0.7817971 -0.2781535 0.0821228 -0.2617146 0.0511049 -0.1286547 -0.0357252 -0.0439883 -0.0082556 -0.074814 0.0577994 0.0002007 -0.0086047 -0.1096747 1.166121 0.0997363 0.0798986 0.1542828 -0.3446655 -0.0915494 -0.184859 -0.0895948 0.0535651 0.259413 -0.4021179 -0.181711 -0.4932621 0.7449235 0.2371056 -0.1691018 0.1757968 -0.0721906 0.1591157 0.3314911 -0.0517603 0.3841829 0.8943586 0.0665186 0.0387425 0.0871756 -0.115843 -0.5562594 0.1333802 0.0874542 0.1341102 -0.1921789 -0.0545958 0.0830437 -0.0423587 -0.0416886 -0.5109645 -0.1766901 0.0301893 -0.18373 -0.2562514 -0.0089805 0.0364399 -0.0107592 -0.0318754 1.3375731 0.1027147 -0.1653062 0.1162416 0.1617444 0.0352596 -0.1837372 0.0301726 -0.1085621 -0.0175725 -0.0710212 0.0206747 -0.0053322 -0.0103993 0.110242 -0.0980469 0.0494135 -0.0129604 0.0370105 0.0331706 0.0094798 -0.0140851 -0.0172367 -0.1069137 -0.0611241 -0.0547566 0.00109 -0.0354547 0.0275416 0.0444804 -0.0185515 -0.0292293 0.0802071 0.0334458 0.0509039 0.0672899 0.1549373 -0.036219 -0.0640575 0.0098038 -0.0394031 0.054429 -0.0900865 0.0175516 0.025358 0.1109957 -0.0223253 -0.0054395 -0.0194071 -0.0053926 0.1113059 -0.0024372 0.0944978 0.0003887 0.0965772 0.0737477 0.0363525 0.0394669 -0.0369076 -0.1069324 0.0201224 -0.0664659 0.049079 -0.106786 -0.0081212 0.0250783 -0.0041397 0.1092187 -0.0086739 0.0649696 0.0123563 0.0663761 0.0819704 -0.0318175 0.0011204 -0.0392023 0.0297567 -0.01568 0.0088551 -0.01678 0.1546011 0.0710326 0.0353943 0.0153935 0.0419991 0.0407106 -0.021299 0.0160894 -0.0180467 0.1533243 unknown
polarizability: 245.8095821|1.6269314|240.8290404|-10.3572606|-7.0539108|108.1356038 unknown
InChI: InChI=1S/C10H9Br5O/c1-10(15,4-11)5-16-9-7(13)2-6(12)3-8(9)14/h2-3H,4-5H2,1H3
charge 0 multiplicity 1
25 atoms
Br -3.186262 -2.051464 0.964884
Br -3.540543 2.540982 -0.318899
Br 0.31323 2.776213 0.724618
Br 0.739756 -2.977804 -0.12999
Br 5.465714 0.352012 -0.338147
O  -0.649957 -0.171914 0.462824
C  -2.987818 -0.382907 -0.265971
C  -1.525714 -0.315685 -0.724491
C  -3.401334 0.754808 0.675499
C  -3.924733 -0.611666 -1.460847
C  0.723902 -0.066568 0.213759
C  1.374357 1.192967 0.327458
C  1.541141 -1.200356 -0.048944
C  2.769081 1.331978 0.172817
C  2.937113 -1.092799 -0.217506
C  3.531317 0.180536 -0.107899
H  -1.402169 0.57648 -1.372909
H  -1.260243 -1.22983 -1.285506
H  -4.407665 0.601273 1.087745
H  -2.653042 0.927984 1.460318
H  -3.857909 0.240991 -2.161856
H  -3.658731 -1.537437 -1.997736
H  -4.970541 -0.695354 -1.122066
H  3.240806 2.312294 0.267903
H  3.540044 -1.981432 -0.416858
