program: Gaussian 09
title: 000118250
version: EM64L-G09RevD.01
frameworkgroup: C1[X(C21H19N5O7)]
method: RPBEPBE
basis: SDD
operation: Freq
keyword: #p
keyword: freq=noraman
keyword: PBEPBE/SDD
title: #p freq=noraman PBEPBE/SDD
converged: YES YES NO NO
title: Mulliken charges:
elementType: O O O O O O O N N N N N C C C C C C C C C C C C C C C C C C C C C H H H H H H H H H H H H H H H H H H H
charge: -0.238823 -0.262194 -0.191053 -0.272317 -0.275569 -0.266658 -0.243740 -0.451428 -0.436819 -0.466319 -0.038437 -0.092677 0.296309 0.244116 0.519230 -0.485656 -0.314093 -0.474450 0.103788 -0.370433 0.206069 0.195744 0.135858 0.142887 -0.437103 0.285835 -0.309488 -0.364686 -0.766283 0.198040 0.175981 -0.499619 -0.497450 0.314629 0.230481 0.334897 0.271598 0.326765 0.389022 0.274058 0.319403 0.276808 0.280091 0.295201 0.247133 0.227979 0.243243 0.247963 0.240496 0.244850 0.244187 0.242631
chargesum: 0.00000
title: Mulliken charges with hydrogens summed into heavy atoms:
elementType: O O O O O O O N N N N N C C C C C C C C C C C C C C C C C C C C C
charge: -0.238823 -0.262194 -0.191053 -0.272317 -0.275569 -0.266658 -0.243740 -0.116531 -0.110054 -0.077297 -0.038437 -0.092677 0.296309 0.244116 0.519230 -0.171027 -0.083613 -0.202851 0.103788 -0.096375 0.206069 0.195744 0.135858 0.142887 -0.117700 0.285835 -0.032680 -0.084595 0.004030 0.198040 0.175981 0.232083 0.234218
polarizability: 4.96186024e+02 9.64938597e+00 3.43132473e+02 6.42158085e-01 8.13252351e+00 1.82633000e+02
1716.lowfreq: -3.9973 -1.9872 -0.0008 -0.0007 -0.0006 2.7210 10.4375 22.9236 35.2063
frequency: 10.3598 22.9214 35.2040 36.5956 40.4556 43.3595 50.3444 57.3055 70.7674 78.2951 82.3278 88.8863 93.0346 97.6780 110.2035 128.2089 131.9967 138.3654 155.1290 162.8891 187.0296 196.7464 207.9571 224.1000 242.5190 258.4994 265.0659 281.6479 291.5042 295.0811 318.7277 319.6797 341.4554 370.0607 378.5645 392.4924 409.0897 433.9789 438.0460 447.8645 463.2859 483.7804 512.6853 529.8312 532.6185 542.9880 562.5395 576.4015 594.3982 598.3166 611.4466 635.7467 665.0053 671.8608 686.4738 691.0031 708.7168 729.6838 745.0079 750.9268 752.9663 767.0646 788.2352 801.1677 805.7463 844.6030 848.9019 862.2695 878.2618 893.1005 913.4808 914.6451 927.1984 938.9867 944.7096 947.1106 951.0186 953.4795 970.1762 1002.7468 1019.1187 1032.1462 1057.7300 1078.6661 1112.7447 1114.8824 1130.2476 1132.3572 1139.4246 1150.3152 1152.0818 1175.0040 1183.2927 1186.1164 1211.4643 1222.7393 1242.3666 1245.4846 1263.0224 1271.5068 1274.7373 1284.5225 1286.8647 1328.8525 1349.0104 1370.7282 1380.2887 1393.8527 1406.8775 1422.5293 1424.0704 1428.8369 1437.1081 1447.7044 1453.1729 1453.3625 1461.2742 1461.9997 1480.0682 1488.5177 1497.9621 1551.3669 1563.4692 1591.3906 1603.5622 1613.7543 1624.9454 1625.6172 1627.5357 1648.3009 1700.3280 2928.5019 2984.9700 3005.6583 3007.2747 3070.1903 3108.9377 3109.9505 3126.2868 3147.7494 3155.1264 3156.3543 3162.7452 3169.1338 3178.8598 3185.1474 3193.3875 3373.8601 3622.3589 3624.0450
redmass: 7.0233 5.4958 5.0736 5.9418 5.1332 6.0992 7.4604 6.5080 4.8114 4.1800 2.2165 4.7903 1.1918 2.0208 3.7847 3.4184 2.4328 3.1421 3.2708 3.3844 4.5388 5.7657 6.6269 5.4213 5.9315 6.5219 6.3944 5.8153 6.1512 5.0517 7.0144 5.5392 8.3957 6.9758 7.1141 5.7065 5.9497 3.2163 5.8589 4.6335 4.3429 7.8455 5.1416 4.6202 1.1921 5.4954 5.6700 1.0471 6.4222 6.0945 4.5985 3.9295 6.4864 6.3390 5.9704 6.9030 12.0063 5.0458 5.7471 6.6268 4.3096 5.8209 4.4827 2.1545 1.9796 3.4256 1.3973 3.5762 1.5204 4.8599 1.4359 7.2802 2.4715 3.2273 1.3886 1.9679 4.2954 5.1355 2.9640 1.3744 2.9992 2.2301 6.0558 3.1156 1.2634 1.2638 2.5932 2.0420 2.1861 1.5253 1.4960 1.8181 1.7297 2.1989 1.8386 1.7200 2.5067 1.4992 3.8278 1.8061 2.0682 2.6425 2.2159 1.6625 4.0801 1.2511 3.4387 10.6111 3.0256 1.2264 1.2044 8.7345 1.0863 1.0788 1.0497 1.0506 1.0530 1.0515 2.9424 5.4609 3.2737 2.1879 6.2483 7.9364 7.2798 6.9857 5.6234 9.2747 5.6019 6.9176 7.9034 1.0792 1.0367 1.0299 1.0297 1.0950 1.1047 1.1047 1.1012 1.0889 1.1046 1.1049 1.0895 1.0963 1.0928 1.0963 1.0937 1.0808 1.0798 1.0821
irintensity: 0.0638 0.3031 2.9876 0.4077 1.5987 3.7064 0.7791 0.2692 0.1462 0.2779 0.3117 4.4845 0.2969 1.5527 0.0509 0.4023 2.8513 0.9821 3.2769 3.4352 12.1271 2.6602 0.4225 0.9506 7.2131 6.3085 3.3822 33.5991 1.6287 2.8033 4.2146 10.3510 0.4300 0.6124 5.1116 2.5478 8.0837 2.1196 3.3115 0.4931 5.7161 30.5372 7.5319 15.0390 14.1066 1.8406 2.1253 234.5699 5.2426 6.4931 11.4228 10.2154 3.8470 1.7357 7.3352 36.6770 18.3305 22.5366 20.6402 4.8694 1.5279 7.9611 4.9850 2.6692 7.4694 10.4229 98.1723 12.5307 19.8308 1.4332 44.3788 13.9816 53.0238 4.9872 16.2043 7.9529 19.1652 9.1954 29.9285 0.4006 31.6775 13.4625 133.2046 219.7041 0.1585 0.0565 20.1631 26.8957 12.9990 32.5271 60.8829 46.6210 48.8501 140.5944 43.1517 91.0934 429.0207 5.7181 56.9346 67.5711 24.4863 92.4448 10.9360 57.7239 48.8070 111.6075 7.0831 16.1504 13.4541 48.0857 4.2470 23.4224 56.4348 44.4448 14.7051 17.4450 22.3122 8.4384 47.0779 31.4241 402.1841 100.2836 41.4334 273.0543 137.1755 208.5665 14.4277 158.3770 65.1058 3.6273 1043.1760 19.4949 9.2322 30.8078 34.3521 12.8800 22.4152 23.8929 11.6688 9.5404 15.9822 9.9778 0.4231 7.5290 3.6891 1.5012 12.0466 228.7307 106.7859 47.3473
temp: 298.150 k
press: 1.00000 atm
elementType: 8 8 8 8 8 8 8 7 7 7 7 7 6 6 6 6 6 6 6 6 6 6 6 6 6 6 6 6 6 6 6 6 6 1 1 1 1 1 1 1 1 1 1 1 1 1 1 1 1 1 1 1
symmnumber: 1
zpe: 999162.2 jmol-1
zpe.correction: 0.380561 hartree
zpe.thermalcorrener: 0.412044 hartree
zpe.thermalcorrenthalpy: 0.412988 hartree
zpe.thermalcorrgfe: 0.313955 hartree
zpe.sumelectzpe: -1609.613129 hartree
zpe.sumelectthermal: -1609.581646 hartree
zpe.sumelectthermalent: -1609.580702 hartree
zpe.sumelectthermalfe: -1609.679735 hartree
dipole: 2.7557 -4.8260 -3.3997
dipole: 6.5148
quadrupole: -230.7210 -163.7415 -188.2324
quadrupole: 13.2682 17.6042 7.1517
quadrupole: -36.4894 30.4901 5.9993 13.2682 17.6042 7.1517
hfenergy: -1609.9936902 hartree
pointgroup: C01 [X(C21H19N5O7)]
dipole: -0.9285425 1.8490583 -1.512726 debye
polarizability: 496.5382141|1.6267073|340.3899482|8.842049|-20.0473637|185.0233342 unknown
InChI: InChI=1S/C21H19N5O7/c1-10(27)17(18(28)22-12-5-7-14-16(9-12)24-21(31)23-14)26-25-15-8-11(19(29)32-2)4-6-13(15)20(30)33-3/h4-9,17,22-24H,1-3H3
charge 0 multiplicity 1
52 atoms
O  8.210896 -0.324813 2.363231
O  1.687963 -3.160671 0.082319
O  -2.138672 -3.970355 -0.733973
O  -1.120966 3.694505 -1.743095
O  -5.984176 -0.829146 1.419205
O  0.062426 1.749616 -1.291792
O  -6.830275 1.328662 1.664374
N  6.083521 -1.1744 1.629394
N  6.523867 0.983734 1.25735
N  1.528157 -0.89078 -0.506247
N  -1.294673 -1.440134 -0.336386
N  -1.585421 -0.40248 -1.054615
C  4.955439 -0.641108 0.980127
C  5.237611 0.739561 0.743015
C  2.795211 -0.402687 -0.057797
C  3.747912 -1.237793 0.591957
C  4.293541 1.557875 0.101406
C  3.070551 0.97533 -0.297487
C  7.08495 -0.190536 1.82071
C  -0.364433 -2.346779 -1.072906
C  1.057474 -2.188244 -0.430335
C  -0.941458 -3.784113 -1.067673
C  -2.511501 0.520185 -0.468854
C  -2.305043 1.917686 -0.678326
C  -3.685853 0.056843 0.169463
C  -4.666512 0.984733 0.585368
C  -3.306327 2.833105 -0.265782
C  -4.479925 2.373674 0.357894
C  -0.043924 -4.895491 -1.565026
C  -1.018785 2.397263 -1.251718
C  -5.926663 0.55199 1.268799
C  0.121758 4.280154 -2.301625
C  -7.194915 -1.355775 2.093604
H  3.524921 -2.290636 0.769019
H  4.48957 2.617617 -0.089486
H  6.208754 -2.134071 1.942918
H  2.31383 1.588815 -0.795353
H  7.029813 1.865996 1.252974
H  0.900357 -0.170779 -0.899371
H  -0.281928 -2.026628 -2.137519
H  -3.828392 -1.017022 0.318116
H  -3.141987 3.901071 -0.428876
H  -5.2612 3.067352 0.68308
H  0.7591 -5.061634 -0.823752
H  -0.634472 -5.812975 -1.7102
H  0.457571 -4.612279 -2.509788
H  -0.174563 5.278423 -2.650949
H  0.493088 3.660782 -3.134714
H  0.896117 4.346691 -1.518627
H  -7.272837 -0.939261 3.111749
H  -8.096712 -1.085087 1.519387
H  -7.048884 -2.444086 2.117712
