program: Gaussian 09
title: 000118178
version: EM64L-G09RevD.01
frameworkgroup: C1[X(C10H16O2)]
method: RPBEPBE
basis: SDD
operation: Freq
keyword: #pfreq=noraman
keyword: PBEPBE/SDD
title: #p freq=noraman PBEPBE/SDD
converged: YES YES NO NO
title: Mulliken charges:
elementType: O O C C C C C C C C C C H H H H H H H H H H H H H H H H
charge: -0.230719 -0.225838 0.031786 -0.426215 -0.426750 -0.493626 -0.503115 0.194805 -0.174158 -0.149755 -0.442661 -0.666232 0.215018 0.214943 0.216152 0.229392 0.213693 0.194236 0.227376 0.242817 0.255474 0.222944 0.219129 0.201028 0.204121 0.211553 0.211193 0.233408
chargesum: 0.00000
title: Mulliken charges with hydrogens summed into heavy atoms:
elementType: O O C C C C C C C C C C
charge: -0.230719 -0.225838 0.246804 0.004879 0.016335 -0.072014 -0.004823 0.194805 0.048786 0.069374 -0.037512 -0.010078
polarizability: 1.38519513e+02 7.19981026e+00 1.15605403e+02 2.60111406e+00 4.05880613e+00 8.61378937e+01
1716.lowfreq: -13.9008 -6.7948 -0.0007 -0.0007 -0.0006 7.8189 15.7926 32.2746 59.6949
frequency: 12.6143 32.2042 59.6406 90.2494 98.9658 113.5191 172.3047 207.9082 255.2839 275.1360 304.1052 386.1463 407.3171 425.4369 455.8165 496.8906 517.9725 531.6572 603.7453 699.2038 770.8287 803.3301 829.6215 870.9789 875.9924 901.7193 915.5056 944.9566 968.2656 1001.8357 1019.2822 1051.2947 1061.2647 1068.2699 1098.3076 1100.5180 1134.4874 1141.3913 1173.0448 1201.8907 1212.7840 1242.3389 1248.7101 1266.5357 1286.4356 1298.1067 1318.2847 1320.5914 1326.3029 1342.0373 1348.2588 1361.5042 1385.5287 1439.1807 1441.8510 1457.1816 1463.5003 1472.9205 1475.5085 1484.8499 1651.4931 1694.1118 2959.7034 2963.1941 2976.4302 2979.5198 2987.3665 2989.1387 2991.8044 3023.2898 3039.6051 3050.4029 3056.4526 3067.0251 3072.8875 3073.7003 3079.0218 3088.1760
redmass: 2.7643 4.4276 2.9223 4.0667 2.7575 2.2434 2.7961 1.3112 1.8210 2.4156 3.2497 2.6384 3.4637 2.6744 3.4418 2.8574 2.6783 3.3310 3.0025 3.3848 1.2663 1.6389 1.6023 2.0120 4.2870 2.0746 1.9940 1.9605 1.1076 2.1584 2.4629 1.8007 2.7257 1.8593 2.0434 1.9258 2.0408 2.4625 1.8071 1.3267 1.5110 1.1856 1.2407 1.2294 1.2662 1.2800 1.3744 1.3687 1.3372 1.4241 1.4423 1.6598 1.1999 1.0930 1.0820 1.0902 1.0771 1.0428 1.0875 1.0620 12.0116 6.5826 1.0638 1.0613 1.0822 1.0356 1.0655 1.0646 1.0635 1.0977 1.0951 1.0979 1.1009 1.0950 1.0965 1.0968 1.0913 1.1005
irintensity: 1.7681 2.3085 2.9465 0.2029 0.3929 0.3293 1.2124 0.3807 2.1760 0.9298 0.8284 1.8390 1.2156 7.6645 1.7305 4.8669 0.8792 1.5390 6.6877 9.2020 8.7218 2.2274 16.1493 1.5067 25.8907 1.7381 30.8337 9.1765 62.3143 8.8195 160.8782 48.4465 6.1470 1.5579 1.5087 10.7228 36.5713 63.8872 31.4994 26.4379 79.9970 1.1881 3.4648 0.1721 2.2306 2.2488 2.6099 5.5988 0.9658 2.2909 3.1162 7.7586 8.8555 6.5600 10.0678 18.1464 7.2165 10.7531 11.9061 11.9064 270.7297 1.0240 34.9452 45.0599 17.6831 36.5983 26.8553 29.9832 19.5966 13.6885 1.7949 36.1010 45.1784 14.3206 7.2222 15.3432 107.8954 49.2776
temp: 298.150 k
press: 1.00000 atm
elementType: 8 8 6 6 6 6 6 6 6 6 6 6 1 1 1 1 1 1 1 1 1 1 1 1 1 1 1 1
symmnumber: 1
zpe: 628127.0 jmol-1
zpe.correction: 0.239241 hartree
zpe.thermalcorrener: 0.252479 hartree
zpe.thermalcorrenthalpy: 0.253424 hartree
zpe.thermalcorrgfe: 0.196965 hartree
zpe.sumelectzpe: -540.146411 hartree
zpe.sumelectthermal: -540.133172 hartree
zpe.sumelectthermalent: -540.132228 hartree
zpe.sumelectthermalfe: -540.188686 hartree
dipole: -1.7619 -4.7001 -0.3828
dipole: 5.0341
quadrupole: -62.1076 -83.8641 -69.8207
quadrupole: 6.4243 0.2067 0.3758
quadrupole: 9.8232 -11.9333 2.1101 6.4243 0.2067 0.3758
hfenergy: -540.3856516 hartree
pointgroup: C01 [X(C10H16O2)]
dipole: -0.6158829 1.868557 0.2276158 debye
polarizability: 137.9237218|-8.1212063|115.8261207|-2.0634664|5.4127095|86.5129675 unknown
InChI: InChI=1S/C10H16O2/c1-2-3-4-6-9-7-5-8-10(11)12-9/h3-4,9H,2,5-8H2,1H3
charge 0 multiplicity 1
28 atoms
O  -0.736989 -0.507893 -0.04842
O  -1.74038 -2.533303 -0.307086
C  -0.780627 0.958721 0.292407
C  -2.099756 1.611646 -0.144154
C  -3.293811 0.80596 0.404159
C  0.470839 1.581248 -0.358881
C  -3.261648 -0.626126 -0.16831
C  -1.887134 -1.303139 -0.157762
C  1.774591 1.121987 0.259538
C  2.74382 0.434177 -0.395404
C  4.039028 -0.053878 0.218683
C  4.177992 -1.597003 0.138287
H  -0.694136 1.005336 1.397886
H  -2.146699 1.665919 -1.250062
H  -2.116823 2.649632 0.238072
H  -4.252209 1.291649 0.146321
H  -3.236007 0.772811 1.510148
H  0.370948 2.683267 -0.257516
H  0.454904 1.348955 -1.440285
H  -3.585001 -0.615612 -1.228739
H  -3.956399 -1.302481 0.358611
H  1.921003 1.367672 1.32406
H  2.58141 0.16978 -1.452941
H  4.899454 0.408229 -0.309056
H  4.099484 0.273601 1.274572
H  4.141534 -1.943196 -0.911373
H  5.137322 -1.931744 0.574292
H  3.354489 -2.092515 0.682054
