program: Gaussian 09
title: 000118164
version: EM64L-G09RevD.01
frameworkgroup: C1[X(C7H15BrO2)]
method: RPBEPBE
basis: SDD
operation: Freq
keyword: #p
keyword: freq=noraman
keyword: PBEPBE/SDD
title: #p freq=noraman PBEPBE/SDD
converged: YES YES NO NO
title: Mulliken charges:
elementType: Br O O C C C C C C C H H H H H H H H H H H H H H H
charge: -0.033239 -0.255407 -0.277842 0.100380 -0.232748 -0.349713 -0.693105 -0.671963 -0.223779 -0.671154 0.155527 0.176730 0.223001 0.246632 0.239096 0.246185 0.206090 0.226542 0.272674 0.276682 0.193106 0.184846 0.204038 0.223548 0.233874
chargesum: 0.00000
title: Mulliken charges with hydrogens summed into heavy atoms:
elementType: Br O O C C C C C C C
charge: -0.033239 -0.255407 -0.277842 0.255907 0.166983 0.136015 -0.014287 -0.122608 0.154173 -0.009694
polarizability: 1.39486827e+02 -4.74394028e+00 8.96742366e+01 6.02184939e+00 -2.16663292e+00 7.43386273e+01
1716.lowfreq: -15.1142 -5.6258 -3.1778 -0.0005 -0.0004 0.0008 17.2842 32.3683 41.8017
frequency: 15.5228 32.1967 41.7520 62.7182 83.8863 91.7891 143.7762 167.9741 188.3901 219.1966 237.2983 241.1916 341.1314 345.1449 456.1580 493.8050 537.8526 624.3593 762.2757 789.5231 816.9785 840.9579 856.3005 914.2689 990.5819 1023.1473 1041.1784 1049.6108 1062.9542 1066.3703 1103.6798 1118.9424 1135.0697 1145.9268 1155.7920 1225.8046 1247.0822 1252.4488 1273.6987 1300.0706 1322.3993 1327.6007 1374.5626 1382.4630 1392.1482 1398.4657 1453.1561 1457.2752 1459.3235 1465.0015 1474.6381 1478.0691 1491.0303 1492.8270 2862.7093 2920.7511 2925.7836 2973.1989 2994.7080 3000.6635 3019.9544 3025.0407 3047.4196 3085.4736 3092.3635 3098.2801 3102.1035 3115.0858 3131.6102
redmass: 3.2205 2.4333 1.9609 2.5726 4.6040 2.6180 3.2724 5.4309 1.3271 1.8594 3.3384 1.2347 3.7878 3.9386 3.1323 3.3565 4.1180 4.8001 1.0874 2.5568 1.1093 1.2070 2.6413 2.7969 5.1055 1.1835 3.3092 3.7504 2.9224 2.2669 2.2189 2.5350 1.4862 1.9770 1.3723 1.1842 1.2728 1.1538 1.0915 1.2438 1.1573 1.3579 1.3494 1.2752 1.3176 1.3067 1.1030 1.0449 1.0410 1.0498 1.0780 1.0507 1.0822 1.0816 1.0833 1.0576 1.0640 1.1043 1.0359 1.0356 1.0847 1.0703 1.0561 1.1046 1.0992 1.0998 1.1009 1.1004 1.1108
irintensity: 0.6797 1.4078 1.7209 0.3961 1.3203 1.2791 8.0117 3.1672 0.5496 1.7766 1.2285 0.6072 2.1840 18.1201 0.6914 5.1312 3.0510 34.0857 11.1513 30.3954 3.4007 3.8722 39.4451 79.3829 67.0527 2.5759 119.1073 4.0425 35.9149 80.5791 60.9035 66.8779 12.7824 17.5000 23.3199 24.7379 4.8694 1.1520 1.6749 5.3655 61.4673 51.5899 1.0884 23.6328 19.3436 20.6734 2.7282 9.2752 9.8808 3.2690 6.8136 3.6926 8.0353 4.8957 69.7515 47.6036 96.4127 60.5036 24.4289 17.0661 11.8727 18.2872 27.8845 12.1660 37.4201 29.3091 37.2600 19.7977 20.5815
temp: 298.150 k
press: 1.00000 atm
elementType: 35 8 8 6 6 6 6 6 6 6 1 1 1 1 1 1 1 1 1 1 1 1 1 1 1
symmnumber: 1
zpe: 555431.6 jmol-1
zpe.correction: 0.211553 hartree
zpe.thermalcorrener: 0.225186 hartree
zpe.thermalcorrenthalpy: 0.226130 hartree
zpe.thermalcorrgfe: 0.167018 hartree
zpe.sumelectzpe: -438.782462 hartree
zpe.sumelectthermal: -438.768829 hartree
zpe.sumelectthermalent: -438.767885 hartree
zpe.sumelectthermalfe: -438.826997 hartree
dipole: 3.7875 -1.1161 2.5563
dipole: 4.7038
quadrupole: -72.4607 -70.7412 -71.4119
quadrupole: -0.4828 3.8170 -0.1336
quadrupole: -0.9228 0.7967 0.1260 -0.4828 3.8170 -0.1336
hfenergy: -438.994015 hartree
pointgroup: C01 [X(C7H15Br1O2)]
dipole: 1.4976696 -0.2880521 1.0482194 debye
dipolederiv: -0.621939 -0.0720873 -0.0583671 0.0030534 -0.1603593 0.0102741 -0.1135461 -0.0086172 -0.1678441 -1.435277 -0.1478909 0.0341049 -0.2528452 -0.5589894 0.0083572 -0.0319689 -0.0186402 -0.3882845 -1.0124512 0.3562492 -0.0169166 0.5552151 -0.9358963 0.0738389 0.0520901 -0.0336752 -0.4214803 1.4759594 -0.0325931 -0.0418322 -0.4305467 0.974433 -0.023174 -0.0489043 0.171828 0.5775698 0.6399262 0.1198893 -0.0628128 0.2090436 0.3690694 -0.0090489 -0.0914142 0.0341753 0.4254277 -0.268881 -0.0957803 -0.0323097 0.0451816 0.0519851 0.0565044 -0.1132516 0.0186226 0.0556216 -0.1386248 -0.1045627 0.0345256 -0.0569307 -0.1867484 0.0600374 0.0640487 0.0720527 -0.0035391 0.8425425 0.0130943 0.1521027 0.0360303 0.1417447 -0.0022215 0.1447102 -0.0041582 0.1784495 0.7313513 -0.2495963 0.0558769 -0.1835791 0.4523613 -0.1140073 0.1890691 -0.2048868 0.3885323 0.0100032 0.0608366 0.0245878 0.0774362 -0.0895042 -0.0490086 0.0066583 -0.0433015 0.0408342 -0.0772745 -0.0184909 -0.0026752 0.0638066 -0.043703 0.0803105 -0.0399358 -0.0346592 -0.2642998 -0.0122852 -0.029162 -0.0270711 -0.0631484 0.0176787 -0.0015902 0.0293957 0.0462634 -0.2259653 0.050678 0.0444363 0.0163981 -0.0142405 -0.1422397 -0.0183433 0.0277373 -0.0514049 0.032997 0.0899303 -0.0008549 0.0018072 -0.0120575 0.0755497 0.0061351 0.0024104 0.0159199 -0.1021716 0.0523516 0.0562443 0.0162807 0.0512229 -0.0796145 -0.0481083 0.0307316 -0.0538694 0.062908 0.1155524 0.0039821 -0.0396991 -0.0152258 0.0957789 -0.0189368 -0.0143062 0.0307154 -0.0943689 -0.1687724 -0.0293471 -0.0416594 0.0000592 0.0974365 0.0151092 -0.0514673 0.0118051 0.0815688 0.0791604 0.0904374 0.0464674 0.0783 -0.0904602 -0.0631623 0.0393273 -0.07738 0.0580383 -0.0495749 0.0108755 -0.0758011 -0.0030626 0.079265 0.0126519 -0.0166931 0.0442104 -0.1189918 -0.0701924 0.0980403 -0.0136961 0.0319906 -0.0752849 -0.031227 -0.0223463 -0.0426848 0.0663425 -0.1886536 -0.0629313 -0.0315408 -0.1404835 -0.0957103 -0.0157137 -0.0375022 0.0319389 0.0400401 -0.0228616 0.0432648 0.0982399 0.0336025 0.014827 0.0021729 -0.0066897 0.0632051 -0.2275433 -0.0800992 0.1144118 -0.0932861 0.1042228 0.0264691 0.0272571 -0.111642 0.0503418 0.0372157 -0.0368353 -0.1540659 0.0068909 -0.1027335 -0.0171213 -0.0056712 0.0300996 -0.0121419 0.0900994 0.0962669 -0.0143991 0.0503851 -0.0143112 0.079033 0.0475645 0.0833894 -0.0056593 -0.1211563 unknown
polarizability: 139.6250797|-0.5552765|89.1120454|7.5975328|-2.188212|74.7625656 unknown
InChI: InChI=1S/C7H15BrO2/c1-3-9-7(2)10-6-4-5-8/h7H,3-6H2,1-2H3
charge 0 multiplicity 1
25 atoms
Br -5.111302 -0.629319 -0.285129
O  -0.046753 1.104739 -0.169246
O  1.921993 -0.176633 -0.382642
C  1.34604 1.05105 0.202145
C  -0.844991 -0.013038 0.365691
C  -2.283768 0.205802 -0.132501
C  2.007406 2.308327 -0.35563
C  -3.202371 -0.91682 0.356363
C  3.064229 -0.719532 0.371576
C  3.451271 -2.047463 -0.279359
H  1.446013 0.979723 1.315757
H  -0.799495 -0.004798 1.478866
H  -0.426528 -0.970881 0.000612
H  -2.274779 0.240635 -1.236019
H  -2.648798 1.184683 0.225337
H  1.866372 2.336019 -1.448597
H  3.08916 2.306555 -0.134586
H  1.55495 3.212347 0.086863
H  -3.284827 -0.95866 1.45404
H  -2.922755 -1.904177 -0.043508
H  3.917584 -0.007639 0.341693
H  2.777696 -0.86573 1.437792
H  4.31397 -2.49803 0.244669
H  2.607406 -2.758037 -0.243355
H  3.724877 -1.891522 -1.336831
