program: Gaussian 09
title: 000118048
version: EM64L-G09RevD.01
frameworkgroup: C1[X(C13H17ClN2O)]
method: RPBEPBE
basis: SDD
operation: Freq
keyword: #p
keyword: freq=noraman
keyword: PBEPBE/SDD
title: #p freq=noraman PBEPBE/SDD
converged: YES YES NO NO
title: Mulliken charges:
elementType: Cl O N N C C C C C C C C C C C C C H H H H H H H H H H H H H H H H H
charge: -0.068117 -0.254560 -0.396897 -0.062486 -0.258301 0.170705 -0.413034 -0.368001 -0.485794 0.510964 -0.464525 -0.348276 -0.208928 -0.208507 -0.215042 -0.105249 -0.686545 0.180937 0.207202 0.230605 0.217178 0.221086 0.231719 0.205845 0.291608 0.228137 0.288130 0.225641 0.170285 0.252640 0.252576 0.198976 0.224344 0.235683
chargesum: 0.00000
title: Mulliken charges with hydrogens summed into heavy atoms:
elementType: Cl O N N C C C C C C C C C C C C C
charge: -0.068117 -0.254560 -0.105289 -0.062486 -0.077363 0.170705 0.024774 0.070264 -0.048231 0.510964 -0.236388 -0.060146 0.186998 0.044133 0.037533 -0.105249 -0.027542
polarizability: 2.10837389e+02 -8.34983784e+00 1.34196329e+02 1.74836114e+00 -2.25137011e+00 1.51419590e+02
1716.lowfreq: -10.2506 -6.8496 0.0009 0.0018 0.0025 6.2797 17.7880 30.5635 40.3310
frequency: 17.3653 30.4430 40.2340 56.5258 67.5494 88.2578 119.6004 138.8885 188.3084 197.3191 222.5771 246.3914 250.6415 286.8462 306.1965 325.5789 339.0220 407.2307 414.3737 436.9899 458.6132 499.4957 512.2837 560.5212 620.4373 627.1046 696.9527 707.3236 740.2581 806.6236 819.1393 820.3846 829.6982 847.0356 856.7863 869.1379 892.8495 923.7747 946.6357 953.7396 973.1744 1000.5312 1010.6762 1057.4886 1068.2025 1075.4440 1099.7090 1107.9837 1115.6817 1125.2858 1135.4255 1178.9377 1180.6745 1192.2184 1196.8359 1219.7506 1255.3734 1264.6817 1272.7673 1300.5473 1315.2986 1321.7254 1334.8391 1350.7176 1374.0718 1382.8653 1392.4837 1396.4822 1453.3374 1458.7384 1459.4406 1469.2780 1474.4941 1479.5714 1488.7930 1496.3153 1589.9292 1598.4714 1628.3815 2877.4048 2923.6567 2955.9442 2961.9585 2992.8040 3001.8127 3016.1782 3029.6023 3040.1968 3070.6544 3089.7679 3102.1801 3120.7587 3156.1881 3168.0792 3174.9433 3553.2679
redmass: 3.6914 4.4899 4.4104 2.4194 4.3516 2.4404 3.5375 3.3837 3.7694 3.3917 4.0810 2.2946 2.5149 2.8440 2.5462 4.4882 4.4992 2.4350 1.6997 3.3614 3.2957 4.9888 2.8324 3.1548 6.6840 5.7984 5.9189 3.5558 2.8234 2.8286 2.1085 1.1641 1.4789 2.3741 2.6911 1.4157 2.4584 2.8438 1.4202 2.9852 1.3753 4.3427 3.1813 4.1481 2.7145 2.4354 1.9015 1.6356 2.0881 3.6097 1.5335 1.2912 1.1213 1.3485 1.6481 1.9991 1.1567 1.2188 1.6907 1.3741 1.1991 1.2367 1.3944 1.3891 1.4742 4.5867 1.4674 2.0551 1.2106 1.0469 1.1304 1.2985 2.3314 1.0585 1.0753 1.2370 7.5258 6.1959 6.2924 1.0821 1.0647 1.0670 1.0664 1.0358 1.0629 1.0962 1.0960 1.0931 1.1045 1.0988 1.1011 1.0899 1.0889 1.0951 1.0976 1.0775
irintensity: 5.4384 0.0610 0.0427 0.2315 0.2818 3.4410 1.1188 1.2751 6.6082 3.5639 3.2389 0.4667 2.0854 2.6081 6.7744 0.7829 14.7217 27.5547 98.5357 1.9762 6.5131 5.5045 21.4531 3.4335 0.4446 5.4344 9.2446 3.5560 30.9017 12.0454 19.8929 2.7592 1.2352 30.4328 11.6509 1.1614 18.8164 15.5850 0.3069 6.4289 0.8383 44.0579 10.6445 141.3843 29.2655 24.9300 4.2463 20.6544 6.9961 20.4248 9.0948 10.6855 2.5262 7.5597 1.8649 40.7329 4.6797 3.8970 13.1918 1.1977 29.3141 14.5788 22.1944 32.8419 0.8400 2.5019 24.8449 3.1131 36.5400 12.4717 9.7524 38.7098 66.3819 6.2995 3.7253 40.3542 1.0288 15.1520 109.4113 56.1391 81.2722 39.1843 102.8916 31.5156 14.7902 26.3839 41.1044 48.1758 51.3788 38.0553 33.6942 13.5313 1.1689 5.4312 1.2840 9.9853
temp: 298.150 k
press: 1.00000 atm
elementType: 17 8 7 7 6 6 6 6 6 6 6 6 6 6 6 6 6 1 1 1 1 1 1 1 1 1 1 1 1 1 1 1 1 1
symmnumber: 1
zpe: 727934.6 jmol-1
zpe.correction: 0.277256 hartree
zpe.thermalcorrener: 0.294344 hartree
zpe.thermalcorrenthalpy: 0.295288 hartree
zpe.thermalcorrgfe: 0.229688 hartree
zpe.sumelectzpe: -1149.064777 hartree
zpe.sumelectthermal: -1149.047690 hartree
zpe.sumelectthermalent: -1149.046745 hartree
zpe.sumelectthermalfe: -1149.112345 hartree
dipole: -3.9607 -2.6067 3.1902
dipole: 5.7149
quadrupole: -111.9965 -104.3803 -98.7797
quadrupole: 4.3069 -2.2522 -0.3202
quadrupole: -6.9443 0.6718 6.2725 4.3069 -2.2522 -0.3202
hfenergy: -1149.3420331 hartree
pointgroup: C01 [X(C13H17Cl1N2O1)]
dipole: -1.6871246 0.9380563 -1.1528027 debye
polarizability: 208.8188278|14.2288388|136.1759172|-3.6293992|-3.4998303|151.4585629 unknown
InChI: InChI=1S/C13H17ClN2O/c1-2-17-12(13-15-8-3-9-16-13)10-4-6-11(14)7-5-10/h4-7,12,15H,2-3,8-9H2,1H3
charge 0 multiplicity 1
34 atoms
Cl 5.230875 0.820007 0.216335
O  -0.839396 -2.058338 -0.063789
N  -1.943786 1.304064 -1.097471
N  -1.929779 0.336816 1.114095
C  -0.650043 -0.763447 -0.705855
C  -1.583126 0.342079 -0.151441
C  -2.51555 2.782509 0.788655
C  -2.701259 2.514183 -0.722225
C  -2.764969 1.477315 1.583419
C  0.809122 -0.378978 -0.496288
C  1.65345 -0.082075 -1.590288
C  1.326813 -0.31439 0.821794
C  -2.203153 -2.606584 -0.204441
C  3.003358 0.288516 -1.384974
C  2.672402 0.046036 1.044893
C  3.487408 0.34643 -0.065564
C  -2.183982 -4.001023 0.420094
H  -0.854609 -0.855303 -1.801291
H  -3.204142 3.58322 1.114285
H  -1.480646 3.126134 0.97376
H  -3.778725 2.382854 -0.952739
H  -2.337224 3.373231 -1.316338
H  -2.549476 1.632458 2.655775
H  -3.836928 1.193463 1.51478
H  -1.592267 1.216221 -2.050881
H  1.270772 -0.152574 -2.616076
H  0.662084 -0.545694 1.659665
H  -2.91978 -1.942327 0.316781
H  -2.474063 -2.654527 -1.284091
H  3.660521 0.516389 -2.229025
H  3.080208 0.093924 2.058831
H  -3.184528 -4.466749 0.353501
H  -1.456236 -4.651394 -0.09535
H  -1.897848 -3.935746 1.483767
