program: Gaussian 09
title: 000118019
version: EM64L-G09RevD.01
frameworkgroup: C1[X(C12H9FN2O2)]
method: RPBEPBE
basis: SDD
operation: Freq
keyword: #p
keyword: freq=noraman
keyword: PBEPBE/SDD
title: #p freq=noraman PBEPBE/SDD
converged: YES YES NO NO
title: Mulliken charges:
elementType: F O O N N C C C C C C C C C C C C H H H H H H H H H
charge: -0.199347 -0.257688 -0.178822 -0.101270 -0.352718 -0.338989 0.374308 -0.006634 0.250349 0.167595 -0.314329 -0.362948 -0.245833 -0.196347 -0.404327 0.144186 -0.441072 0.289594 0.249411 0.259622 0.235411 0.355348 0.238932 0.276017 0.276785 0.282766
chargesum: 0.00000
title: Mulliken charges with hydrogens summed into heavy atoms:
elementType: F O O N N C C C C C C C C C C C C
charge: -0.199347 -0.257688 -0.178822 -0.101270 0.002630 -0.049395 0.374308 -0.006634 0.250349 0.167595 -0.064919 -0.103325 -0.010422 0.042585 0.148475 0.144186 -0.158306
polarizability: 2.09923620e+02 -9.18219549e+00 1.17686455e+02 3.42466539e+00 -3.99371445e+00 1.15140435e+02
1716.lowfreq: -4.4924 -0.0010 -0.0010 -0.0006 2.0851 7.0708 10.2705 17.9835 39.3976
frequency: 3.0681 17.8969 39.3935 76.6524 97.4790 137.8471 152.4668 181.7439 185.1364 200.8181 236.5179 296.9121 308.7327 391.6735 430.5773 457.3398 469.3585 489.7160 507.8573 522.5341 551.3588 602.2505 626.7148 640.6842 660.9484 686.4430 686.5189 730.3651 737.2967 766.4322 786.8838 829.7838 845.3202 873.7310 890.0317 928.6308 951.7499 967.2842 980.7081 987.1238 1032.5581 1078.7498 1080.9589 1140.0135 1164.0557 1176.0883 1195.7338 1220.3840 1228.3792 1241.4089 1281.9884 1303.3235 1350.1191 1390.0878 1441.1897 1471.9016 1475.5992 1482.5804 1590.5008 1598.7208 1623.5420 1694.8986 2157.0870 2991.2742 3035.6783 3075.8254 3138.2156 3149.3356 3167.5270 3182.0560 3424.6203 3576.7731
redmass: 4.1143 6.6476 4.7042 5.5500 5.5564 5.6068 6.9847 5.5820 5.2252 10.3123 6.3800 5.4315 3.1808 7.5869 5.3747 5.0615 5.3523 6.7629 1.1566 4.2735 6.7426 5.2898 8.4946 1.2295 7.9781 4.1225 1.5214 8.3460 4.7984 1.2806 6.7893 6.2978 2.6663 2.1920 5.7529 4.9974 1.4013 1.6591 4.5341 1.3291 2.0847 3.1671 4.2627 6.7365 1.3022 1.3354 2.0252 1.9482 1.0721 1.7882 1.8462 1.3621 1.4680 6.6776 2.3456 1.2641 1.4550 2.6027 6.5664 11.3038 7.5898 12.2898 5.9918 1.0584 1.1023 1.0850 1.0874 1.0906 1.0956 1.0991 1.1614 1.0786
irintensity: 0.8825 1.4318 1.9940 1.5844 2.5039 8.0136 2.6616 2.3343 1.3861 0.4310 0.9287 0.3187 13.2357 0.8710 3.0182 9.5267 3.1923 16.9902 100.2832 4.7770 1.4539 28.6308 1.1308 77.7466 3.4393 25.1435 49.6814 6.5515 25.6065 95.0435 20.9861 6.1941 46.5347 11.3021 56.5674 85.4885 0.6879 0.4163 7.0157 0.3129 4.4927 29.9763 39.6471 265.9897 8.0288 9.9486 69.8514 22.9982 0.0430 10.1917 23.3206 7.1878 47.7207 2.1834 26.2688 91.9081 92.8852 41.4790 42.2472 1226.9564 13.8366 51.7775 0.1262 12.1075 5.6088 5.1935 1.0848 8.3503 12.8086 7.0220 77.3780 99.5599
temp: 298.150 k
press: 1.00000 atm
elementType: 9 8 8 7 7 6 6 6 6 6 6 6 6 6 6 6 6 1 1 1 1 1 1 1 1 1
symmnumber: 1
zpe: 485056.7 jmol-1
zpe.correction: 0.184748 hartree
zpe.thermalcorrener: 0.200053 hartree
zpe.thermalcorrenthalpy: 0.200997 hartree
zpe.thermalcorrgfe: 0.137664 hartree
zpe.sumelectzpe: -821.196597 hartree
zpe.sumelectthermal: -821.181292 hartree
zpe.sumelectthermalent: -821.180348 hartree
zpe.sumelectthermalfe: -821.243681 hartree
dipole: 1.7641 -5.2519 -0.4674
dipole: 5.5599
quadrupole: -70.4191 -108.6882 -95.1710
quadrupole: -0.7447 6.4320 5.7217
quadrupole: 21.0070 -17.2621 -3.7449 -0.7447 6.4320 5.7217
hfenergy: -821.3813452 hartree
pointgroup: C01 [X(C12H9F1N2O2)]
dipole: 0.7320994 1.9377396 -0.7028773 debye
dipolederiv: -0.2410458 0.0312824 -0.030954 0.0092495 -0.3902957 -0.3777167 -0.0944058 -0.375673 -0.780166 -1.5583223 0.2435679 -0.1964546 -0.1001808 -0.35979 0.1734598 -0.1688615 0.1736133 -0.5342618 -0.7671299 -0.2858219 0.2040504 -0.3013428 -0.7400941 0.3185246 0.2846183 0.4170457 -0.62553 -1.4730366 -0.5027827 0.3960231 -0.5719826 -0.7860457 0.4110667 0.2804294 0.4837338 -0.6576578 -1.6489371 -0.3849174 0.2651557 -0.6168867 -0.6289589 0.0925729 0.309088 0.1036657 -0.4371184 0.8161949 -0.1162613 -0.1797034 0.1950603 0.277465 0.144062 -0.6241268 0.3075635 0.0180047 -0.0405202 -0.082139 -0.0452018 0.1087314 -0.1577404 -0.0410788 -0.0211856 -0.049769 -0.1570211 1.5865683 0.6806796 -0.3965421 0.3686113 0.8231163 -0.5466289 0.0882419 -0.6690289 0.6712434 2.1873689 0.3219199 -0.0696635 0.8565429 0.9331837 -0.5938272 -0.2990595 -0.8110956 0.9871449 0.2702048 -0.0711681 0.0086916 -0.0152375 0.3945962 0.4490071 0.2130401 0.38952 0.8334721 0.0184727 -0.035749 0.0643848 -0.1082824 -0.0180923 0.0068433 -0.0059927 0.0611017 0.0165321 -0.0877984 0.060066 0.1676762 -0.0155002 -0.1977925 -0.101985 0.0404973 -0.023214 -0.1522938 -0.2249193 0.0140064 -0.0234709 0.0272256 -0.101652 0.1229479 -0.0345054 0.1186981 0.0380091 0.0728352 -0.1170085 0.0287117 -0.0731753 -0.0267519 0.0935879 0.0844354 0.0651709 0.0437387 1.0368696 0.1436711 0.0064133 -0.0599431 0.2977176 0.0252668 0.3430799 0.0985881 0.286424 -0.0630796 0.0872713 -0.1034767 0.1056913 -0.0265434 -0.0321245 -0.1298999 -0.0304183 -0.0753355 -0.4350464 -0.0562534 0.045681 -0.1213786 -0.327322 0.0133675 0.1005235 0.019483 -0.2918941 0.0348296 -0.0268796 -0.0047654 -0.0232255 0.0413413 -0.0202067 0.0535812 -0.0706561 0.0542175 0.0188076 0.0219222 -0.085009 0.0142653 0.1107165 0.0105434 -0.1007902 -0.0002192 0.0553085 0.0317073 0.0325841 -0.0864131 0.0391698 0.1418378 -0.0263276 -0.0920792 -0.0248522 0.0520683 0.094387 0.0313788 -0.0159647 0.0433925 0.0758618 -0.1036017 0.0026701 -0.1131171 -0.0295555 0.200963 -0.0182431 -0.0455778 0.0469681 0.3009055 0.0437095 -0.1150332 0.0394302 0.2557433 -0.0190368 0.1117986 0.0146747 0.115931 0.0622877 -0.0459006 0.0159329 -0.0453939 0.0996755 -0.0293673 -0.0337976 0.0619109 0.0101807 0.0832259 -0.0354852 -0.0632384 -0.0500327 -0.0245965 -0.0365817 -0.0377124 0.0165767 0.0647349 -0.0368567 0.0078524 -0.0604103 -0.0248743 0.1014317 0.2556123 -0.0114142 0.0032468 0.0013811 0.2556804 0.012071 -0.0065494 0.0107303 0.2524168 unknown
polarizability: 210.0564448|4.6963722|113.9447468|-7.8395913|-3.4484129|118.7493181 unknown
InChI: InChI=1S/C12H9FN2O2/c1-2-7-14-12-15-11(16)10(17-12)8-5-3-4-6-9(8)13/h1,3-6,10,14H,7H2
charge 0 multiplicity 1
26 atoms
F  -2.851227 -0.609601 -2.119651
O  0.528307 -0.083013 -0.984675
O  -0.497719 -2.367936 1.633817
N  1.44829 -1.202747 0.873892
N  2.788956 0.234845 -0.488115
C  -0.609393 -0.891577 -0.380896
C  -1.767473 0.008566 -0.039516
C  0.085475 -1.596063 0.842111
C  1.626399 -0.370089 -0.156658
C  -2.863701 0.135814 -0.919769
C  -1.814367 0.763066 1.160254
C  -3.968192 0.9635 -0.669971
C  -2.905891 1.610754 1.442364
C  -3.981843 1.711454 0.528402
C  4.019994 -0.007966 0.300778
C  5.152623 0.758598 -0.239711
C  6.11504 1.390779 -0.676477
H  -0.891046 -1.630195 -1.148944
H  -0.993392 0.671526 1.880208
H  -4.786307 1.01427 -1.393804
H  -2.924867 2.183283 2.374924
H  2.816737 0.856799 -1.297036
H  -4.833217 2.363926 0.747882
H  3.83552 0.266673 1.356777
H  4.248417 -1.090938 0.296112
H  6.959075 1.939972 -1.053599
