program: Gaussian 09
title: 000118010
version: EM64L-G09RevD.01
frameworkgroup: C1[X(C10H14O)]
method: RPBEPBE
basis: SDD
operation: Freq
keyword: #pfreq=noraman
keyword: PBEPBE/SDD
title: #p freq=noraman PBEPBE/SDD
converged: YES YES NO NO
title: Mulliken charges:
elementType: O C C C C C C C C C C H H H H H H H H H H H H H H
charge: -0.470662 0.333045 -0.198707 0.282936 -0.512696 0.466040 -0.405451 -0.715313 -0.437980 -0.837898 -0.815204 0.202507 0.278233 0.225021 0.243242 0.227143 0.205256 0.227792 0.223723 0.229743 0.230966 0.232531 0.226391 0.219220 0.340123
chargesum: 0.00000
title: Mulliken charges with hydrogens summed into heavy atoms:
elementType: O C C C C C C C C C C
charge: -0.130539 0.333045 0.003800 0.282936 -0.234463 0.466040 -0.180430 -0.039672 -0.210188 -0.153466 -0.137062
polarizability: 1.39202573e+02 3.61703227e+00 1.22666311e+02 -1.89143997e+00 -8.39446649e-02 6.73624082e+01
1716.lowfreq: -15.4091 -0.0009 -0.0005 -0.0005 5.8626 6.3785 25.3204 63.1434 113.6804
frequency: 24.5777 63.1233 113.6651 130.5273 156.8728 182.2692 250.6403 264.5946 279.0048 292.5051 334.7518 348.1986 412.1299 457.0674 465.1502 504.8430 565.0466 603.4052 703.9373 737.8827 755.8056 819.0101 851.5534 912.2396 924.0469 954.6061 978.7883 1003.6847 1014.4303 1037.6168 1048.5960 1053.2733 1076.0335 1112.7753 1157.5411 1192.3854 1222.2225 1253.6907 1289.4587 1301.2617 1359.8595 1383.8890 1388.5681 1395.5090 1403.5544 1414.7717 1463.1698 1468.7574 1469.8956 1471.2812 1475.7481 1481.4838 1498.0900 1587.1148 1626.3205 2953.2205 2968.5035 2973.8402 2974.5231 3040.6134 3053.0563 3067.3256 3078.2435 3080.5899 3093.1235 3110.9882 3135.9830 3148.6575 3562.3929
redmass: 1.0368 3.2758 2.0944 2.0954 1.5971 2.8462 1.1307 2.3345 1.3429 2.3943 3.1136 3.5812 2.8139 4.6005 2.7921 3.3363 4.0019 3.3097 4.9193 3.1022 3.7586 1.2555 2.7993 2.6801 1.3258 1.3532 1.6400 1.5491 1.7196 1.6010 1.5848 2.0454 2.1428 2.0437 1.3313 1.5502 1.6782 2.4457 1.3465 1.2859 3.1441 1.3889 1.5141 1.2743 1.2853 3.2450 1.0675 1.0583 1.0682 1.0772 1.0677 1.1352 2.7851 5.7884 6.7103 1.0829 1.0378 1.0381 1.0372 1.0969 1.0972 1.0968 1.0977 1.0990 1.0998 1.0869 1.0964 1.0913 1.0660
irintensity: 0.5034 2.1237 0.0721 5.5782 0.4572 2.7344 1.0449 22.5959 100.4342 24.7430 2.2834 3.8839 2.5512 1.4945 13.9656 1.0662 15.5304 1.2986 0.4089 1.3623 2.9680 34.9199 16.5289 11.6127 9.1750 1.6004 5.6978 4.1679 1.0824 10.0074 13.9094 73.1003 7.9937 34.9404 22.0381 10.5518 6.9975 0.2211 2.0870 12.8456 5.8642 19.1559 7.6339 15.5841 2.1083 6.0239 12.5889 5.6736 4.4491 6.3776 18.1700 30.9550 26.8198 1.7017 5.7103 44.2093 42.2489 61.8343 19.6412 24.5230 22.8054 44.1386 23.7587 24.2820 21.7868 14.8823 34.2920 2.8346 3.7749
temp: 298.150 k
press: 1.00000 atm
elementType: 8 6 6 6 6 6 6 6 6 6 6 1 1 1 1 1 1 1 1 1 1 1 1 1 1
symmnumber: 1
zpe: 556133.7 jmol-1
zpe.correction: 0.211820 hartree
zpe.thermalcorrener: 0.223911 hartree
zpe.thermalcorrenthalpy: 0.224855 hartree
zpe.thermalcorrgfe: 0.173354 hartree
zpe.sumelectzpe: -463.850028 hartree
zpe.sumelectthermal: -463.837937 hartree
zpe.sumelectthermalent: -463.836993 hartree
zpe.sumelectthermalfe: -463.888494 hartree
dipole: 1.7751 0.4367 0.8644
dipole: 2.0222
quadrupole: -54.6941 -62.8585 -71.3526
quadrupole: -1.4512 -0.3189 -1.6268
quadrupole: 8.2743 0.1099 -8.3842 -1.4512 -0.3189 -1.6268
hfenergy: -464.061848 hartree
pointgroup: C01 [X(C10H14O1)]
dipole: 0.6810326 0.2130887 0.35175 debye
dipolederiv: -0.2339129 0.0774617 0.0939181 0.1334222 -0.7178133 -0.141823 0.1370084 -0.1522424 -0.6732901 0.1293012 -0.0804514 0.0419142 -0.1403211 -0.0439975 -0.0261528 0.0208353 -0.0108561 -0.0833971 0.3568624 -0.0884513 -0.054017 -0.1772792 0.607796 0.111353 -0.1358886 0.1413008 0.4903072 0.0515266 0.1819629 -0.027351 0.1630935 0.0888841 -0.0089426 -0.0011627 -0.0269459 -0.0582502 -0.2069631 -0.1108704 -0.0256558 -0.0350783 -0.0136461 0.0097937 -0.0453843 0.0463414 -0.1585569 0.1759758 0.2191077 -0.0055423 0.2298376 0.1804029 -0.0030742 0.024565 0.0097029 -0.0329067 -0.0486538 -0.1019395 -0.0078464 -0.0332794 0.059575 0.0041006 -0.0083176 0.0089036 -0.16277 -0.0138339 -0.0069595 -0.0902748 0.0703732 -0.027138 -0.0063633 -0.0060829 -0.0541917 -0.1618176 0.0099011 -0.0553019 -0.0222876 -0.1434407 -0.1058012 0.0095821 -0.0162316 0.0001429 -0.1770838 -0.0365715 -0.1253752 0.0106629 -0.0555142 -0.0034649 0.0152933 0.0098004 0.019993 0.0771388 0.0093234 -0.0797498 -0.0026441 -0.1427829 -0.0688821 0.0053441 -0.0291445 -0.0288339 0.069693 -0.0669983 -0.0685246 0.0582689 -0.0692648 -0.1056658 0.0591925 0.0581114 0.0712312 -0.0726261 0.1437323 0.0066023 0.0049157 0.0162133 -0.0484086 0.00361 -0.0087643 0.0045029 0.1405107 0.0667652 0.0259114 0.0053905 0.0520585 -0.1461132 -0.0013117 0.006246 -0.0017193 0.1480602 0.046848 -0.0909067 0.0652211 -0.0477459 -0.000984 0.1085981 0.0265373 0.0551464 0.0184365 0.1141692 0.0166263 0.0047387 -0.0101681 -0.094546 -0.1195834 0.0293594 -0.0946584 0.0425716 -0.2337443 0.0951027 -0.0176008 0.1032007 0.0675209 0.0119496 -0.0071253 -0.0051128 0.0521204 -0.1424387 0.051986 0.0217765 0.0412109 0.0734683 -0.0015408 0.0229005 -0.0034559 0.1515876 -0.0631509 -0.058015 -0.1067405 -0.0319337 0.0730733 0.0353582 -0.1457217 -0.0167885 -0.0477953 -0.0208679 -0.0485394 0.1105013 -0.014412 0.062258 -0.0512037 0.1343869 0.0112547 -0.0573369 0.039542 0.1599352 -0.0043237 0.0366307 -0.1218737 0.0068085 0.004079 -0.0064554 0.1058565 0.0444474 -0.0494646 0.0144154 -0.0698281 0.0033551 -0.0938234 -0.0452308 -0.1264839 -0.0703863 0.0449483 0.0180324 -0.0554484 -0.0314029 -0.0401343 0.1139078 0.0097663 0.1420678 -0.0160907 -0.1331616 0.0222764 0.0407142 0.1326541 0.0374516 -0.0274372 0.0507163 -0.0045968 0.0964996 -0.0330459 0.0895443 -0.0527051 0.0237566 0.2846834 -0.0136354 -0.0852579 0.0217535 0.3795256 unknown
polarizability: 138.7234466|4.6342226|123.1851502|-0.7825697|0.2357551|67.3226951 unknown
InChI: InChI=1S/C10H14O/c1-7-4-5-8(2)10(6-7)9(3)11/h4-6,9,11H,1-3H3
charge 0 multiplicity 1
25 atoms
O  2.017216 -1.832782 -0.807329
C  0.531375 -0.042381 -0.126118
C  1.987921 -0.493086 -0.181911
C  0.200093 1.346333 -0.099677
C  -0.492498 -1.013444 -0.053457
C  -1.859556 -0.654299 0.050436
C  -1.166551 1.701484 0.007714
C  2.629788 -0.550115 1.225999
C  -2.18312 0.72311 0.085072
C  1.256198 2.437721 -0.195748
C  -2.940214 -1.721123 0.106012
H  2.56864 0.212622 -0.813738
H  -0.203327 -2.068322 -0.105416
H  -1.438607 2.764149 0.027956
H  2.098148 -1.29227 1.847256
H  2.57054 0.428399 1.734597
H  3.698447 -0.83662 1.167397
H  -3.231978 1.033876 0.166517
H  1.972292 2.408442 0.64779
H  1.851195 2.353912 -1.125934
H  0.784414 3.435192 -0.192693
H  -3.00759 -2.271926 -0.851737
H  -2.730538 -2.468335 0.893844
H  -3.932209 -1.281847 0.310282
H  2.940521 -2.18699 -0.749313
