program: Gaussian 09
title: 000118006
version: EM64L-G09RevD.01
frameworkgroup: C1[X(C15H13NO)]
method: RPBEPBE
basis: SDD
operation: Freq
keyword: #p
keyword: freq=noraman
keyword: PBEPBE/SDD
title: #p freq=noraman PBEPBE/SDD
converged: YES YES NO NO
title: Mulliken charges:
elementType: O N C C C C C C C C C C C C C C C H H H H H H H H H H H H H
charge: -0.310967 -0.011914 0.553374 -0.278753 -0.520746 0.338473 -0.471437 -0.670770 -0.399896 -0.189716 0.347062 -0.186254 -0.355432 -0.387566 -0.202231 -0.194389 -0.249289 0.252357 0.285196 0.235972 0.232854 0.237257 0.233203 0.261944 0.231863 0.268371 0.256733 0.233334 0.230007 0.231360
chargesum: 0.00000
title: Mulliken charges with hydrogens summed into heavy atoms:
elementType: O N C C C C C C C C C C C C C C C
charge: -0.310967 -0.011914 0.553374 -0.026396 -0.235549 0.338473 -0.235465 0.032544 -0.137951 0.042147 0.347062 -0.186254 -0.087061 -0.130833 0.031104 0.035618 -0.017929
polarizability: 2.11339539e+02 2.59685471e+01 1.71452715e+02 1.44887643e+01 -8.33258160e+00 1.11557756e+02
1716.lowfreq: -5.3392 -0.5522 -0.0004 0.0005 0.0005 6.6497 18.0030 30.8998 42.4558
frequency: 17.8788 30.8108 42.3853 55.8799 104.4188 130.4624 185.5945 212.2014 219.3945 225.5560 292.9334 300.9012 319.6017 378.7577 410.1291 416.2071 455.1102 479.8897 535.3814 562.9196 582.8468 610.4445 615.7957 631.8283 691.3892 697.2765 707.1011 761.3580 796.6554 799.9300 835.1291 849.5148 894.5447 897.7899 913.0952 922.8018 969.4075 975.9158 986.7507 987.3086 989.1525 1007.7784 1019.8327 1053.4558 1078.4081 1078.6952 1096.4778 1142.8927 1167.7577 1173.1516 1174.9656 1194.5881 1231.2216 1262.3354 1286.6561 1308.6456 1319.7219 1381.0306 1387.3567 1390.5982 1436.9444 1443.3534 1468.5310 1470.1638 1473.7368 1481.8030 1594.3289 1596.1290 1606.8295 1613.7445 2190.1751 2996.4015 2999.3867 3101.5382 3106.6423 3127.8665 3133.0887 3142.2048 3147.1762 3151.3672 3157.4156 3166.1583 3174.7762 3175.2995
redmass: 4.5571 5.0670 4.2695 5.4605 6.3363 3.9610 4.1755 3.5876 1.8119 1.8309 4.3619 4.8561 5.0523 5.0170 2.9803 6.6384 3.2056 3.4085 5.2437 7.6332 5.1560 5.8795 5.1656 5.5305 2.4018 2.6849 2.7647 1.6070 2.4456 2.1655 1.2655 2.9903 1.4515 1.4140 1.4494 2.7085 1.3636 1.3356 4.7573 5.5092 1.4306 2.3454 2.0905 2.0356 1.5244 1.8273 1.5631 1.9375 1.1470 1.1122 1.2161 2.0867 2.0895 1.7852 1.4016 1.3661 1.4262 6.6205 1.5368 3.3882 2.5715 2.4182 1.0501 2.0688 1.3470 1.7826 6.2811 6.5691 6.6292 6.5020 12.5668 1.0341 1.0828 1.1016 1.1014 1.0881 1.0851 1.0891 1.0917 1.0927 1.0929 1.0963 1.0978 1.1007
irintensity: 4.6120 0.7979 0.2961 2.5321 1.8432 0.2486 2.2242 2.1512 0.1676 0.3937 1.2775 0.6357 0.9575 2.5150 0.8348 1.9601 5.7300 17.9973 5.5192 0.4849 0.2801 1.6504 2.5647 2.7570 37.5438 23.7265 4.0185 86.6344 27.7238 30.2481 1.1144 12.5287 10.3096 3.7120 3.5635 53.4203 0.1266 0.7726 1.1941 1.1900 0.8650 1.0977 13.5623 6.1691 9.9937 17.7813 2.8069 2.8980 29.5013 15.3650 37.8139 107.6009 197.6000 69.1668 25.9126 0.5488 2.3812 4.8070 6.4638 6.7177 43.1398 25.7409 7.0362 174.6203 3.7010 34.2635 30.8856 129.7501 51.9302 5.4351 8.1978 20.1992 7.1309 27.1682 17.9121 6.9842 1.7984 8.6277 8.6578 13.8225 25.3943 12.8428 10.4424 5.2286
temp: 298.150 k
press: 1.00000 atm
elementType: 8 7 6 6 6 6 6 6 6 6 6 6 6 6 6 6 6 1 1 1 1 1 1 1 1 1 1 1 1 1
symmnumber: 1
zpe: 617291.5 jmol-1
zpe.correction: 0.235114 hartree
zpe.thermalcorrener: 0.250185 hartree
zpe.thermalcorrenthalpy: 0.251129 hartree
zpe.thermalcorrgfe: 0.190569 hartree
zpe.sumelectzpe: -708.159288 hartree
zpe.sumelectthermal: -708.144217 hartree
zpe.sumelectthermalent: -708.143273 hartree
zpe.sumelectthermalfe: -708.203833 hartree
dipole: -1.6987 -1.8706 1.3529
dipole: 2.8662
quadrupole: -79.5533 -108.2056 -98.6803
quadrupole: 7.2938 0.2734 4.5706
quadrupole: 15.9264 -12.7259 -3.2005 7.2938 0.2734 4.5706
hfenergy: -708.3944017 hartree
pointgroup: C01 [X(C15H13N1O1)]
dipole: -0.6440455 0.7177914 -0.5844411 debye
polarizability: 211.1396057|-26.9750211|171.2447636|-10.9438886|-11.7720552|111.9656397 unknown
InChI: InChI=1S/C15H13NO/c1-12(11-16)13-6-5-9-15(10-13)17-14-7-3-2-4-8-14/h2-10,12H,1H3
charge 0 multiplicity 1
30 atoms
O  1.192262 1.647709 -0.306149
N  -1.707785 -3.213026 0.951976
C  -2.249346 0.157413 -0.016734
C  -2.994738 -1.173647 -0.202582
C  -0.847891 0.226103 -0.19971
C  -0.190704 1.471213 -0.077201
C  -2.981366 1.332866 0.27553
C  -3.241658 -1.485424 -1.712547
C  -0.914953 2.651938 0.206103
C  -2.311419 2.574169 0.378717
C  2.124138 0.592836 -0.101654
C  -2.281292 -2.299277 0.441555
C  2.041884 -0.299822 0.992126
C  3.210495 0.549077 -1.001781
C  3.061289 -1.262254 1.165723
C  4.225732 -0.413707 -0.810184
C  4.15331 -1.325884 0.268913
H  -3.98051 -1.092862 0.296705
H  -0.276317 -0.679813 -0.427884
H  -4.065965 1.280781 0.425918
H  -3.809616 -2.42397 -1.833592
H  -2.283459 -1.580438 -2.250465
H  -3.814014 -0.658599 -2.166605
H  -0.374749 3.599484 0.287621
H  -2.878737 3.483201 0.605153
H  1.206676 -0.244357 1.697109
H  3.245139 1.264885 -1.828496
H  2.99924 -1.959612 2.008071
H  5.070576 -0.451878 -1.506543
H  4.939279 -2.074906 0.411208
