program: Gaussian 09
title: 000117983
version: EM64L-G09RevD.01
frameworkgroup: C1[X(C9H10N2OS2)]
method: RPBEPBE
basis: SDD
operation: Freq
keyword: #p
keyword: freq=noraman
keyword: PBEPBE/SDD
title: #p freq=noraman PBEPBE/SDD
converged: YES YES NO NO
title: Mulliken charges:
elementType: S S O N N C C C C C C C C C H H H H H H H H H H
charge: 0.781602 0.367320 -0.580523 -0.272966 0.059920 -0.371741 0.362384 -0.527462 -0.271139 -0.328691 -0.616786 -0.601485 -0.231647 -0.209948 0.251338 0.260598 0.285720 0.250226 0.207828 0.230675 0.241807 0.241041 0.235411 0.236518
chargesum: 0.00000
title: Mulliken charges with hydrogens summed into heavy atoms:
elementType: S S O N N C C C C C C C C C
charge: 0.781602 0.367320 -0.580523 -0.272966 0.059920 -0.371741 0.362384 -0.527462 -0.019801 -0.068092 0.126987 0.112038 0.003764 0.026570
polarizability: 2.33385122e+02 4.30091447e+00 1.50834151e+02 2.44797045e+00 -8.15668172e+00 9.48243823e+01
1716.lowfreq: -6.3695 0.0001 0.0003 0.0016 5.2452 8.3542 36.3163 52.3206 68.3396
frequency: 36.1729 52.1580 68.3246 109.5376 124.7171 191.0774 212.5450 222.6233 234.9897 253.1855 274.3854 281.0190 314.5523 359.5203 374.2619 416.4288 427.2255 457.4840 481.1848 514.1419 544.9082 587.3780 616.2417 674.6930 736.3831 772.5354 809.3691 833.8904 851.6710 868.1846 880.4444 954.4216 990.9860 1015.3459 1023.8484 1040.5234 1081.6838 1114.0684 1118.5069 1169.6258 1170.3400 1207.1506 1216.8003 1271.8901 1375.8376 1411.6783 1422.8964 1426.0322 1443.7235 1452.4224 1457.8252 1466.8154 1476.4107 1479.1181 1564.3170 1603.2805 2920.8555 2936.0429 3029.9875 3037.4264 3064.9545 3082.6877 3139.6835 3153.3980 3166.9733 3177.7314
redmass: 4.5677 4.2753 3.4574 7.4081 6.1186 5.9173 3.9668 2.5887 1.5184 1.4661 2.0917 4.7948 5.9474 5.6719 7.9099 3.8034 3.2118 5.1841 8.7922 6.1999 9.3394 4.9409 9.8656 7.2573 2.5403 1.5934 7.1609 15.7962 4.4994 1.3887 9.9397 1.3821 1.3242 2.2168 1.4123 5.4282 1.2297 1.3913 1.5822 2.3680 1.5631 1.6999 2.6566 1.5592 4.8581 1.1297 1.1577 2.7651 2.5301 1.0624 1.0777 2.8552 1.3497 1.0557 6.1757 7.0458 1.0400 1.0409 1.0921 1.0912 1.0992 1.1002 1.0859 1.0904 1.0958 1.1000
irintensity: 1.6731 0.4744 1.2665 5.4229 2.9941 1.4399 1.6252 5.1903 5.0291 2.2555 13.1190 1.4841 10.0091 39.4528 12.3629 6.4175 10.5612 7.9784 0.3308 23.2407 6.1154 6.7297 7.9737 2.9947 22.6996 71.7642 12.1856 45.4475 11.8639 1.2365 32.9891 2.4455 0.0263 7.9252 1.7281 6.7417 0.4128 16.6026 4.6579 3.2852 4.3095 18.5579 4.1322 0.2000 15.1949 25.0259 2.5801 29.6794 4.0367 15.1041 4.4253 40.9824 13.3699 57.7984 2.8330 3.9526 45.6502 43.0438 20.4357 30.4746 5.9816 14.5484 1.7934 6.9211 12.7763 18.2986
temp: 298.150 k
press: 1.00000 atm
elementType: 16 16 8 7 7 6 6 6 6 6 6 6 6 6 1 1 1 1 1 1 1 1 1 1
symmnumber: 1
zpe: 456055.5 jmol-1
zpe.correction: 0.173702 hartree
zpe.thermalcorrener: 0.187894 hartree
zpe.thermalcorrenthalpy: 0.188838 hartree
zpe.thermalcorrgfe: 0.132029 hartree
zpe.sumelectzpe: -1328.670201 hartree
zpe.sumelectthermal: -1328.656010 hartree
zpe.sumelectthermalent: -1328.655066 hartree
zpe.sumelectthermalfe: -1328.711874 hartree
dipole: 3.6026 3.0424 2.0120
dipole: 5.1267
quadrupole: -91.3687 -96.3297 -96.1568
quadrupole: -9.2723 -1.9071 -2.7236
quadrupole: 3.2497 -1.7113 -1.5384 -9.2723 -1.9071 -2.7236
hfenergy: -1328.8439035 hartree
pointgroup: C01 [X(C9H10N2O1S2)]
dipole: 1.4244221 1.3471288 0.473951 debye
dipolederiv: 1.111699 0.1126278 0.2249531 0.168575 0.7872922 0.3644546 -0.0031748 0.2357451 0.3541636 -0.3076115 0.0498493 -0.1150706 0.0955051 -0.14777 0.2011928 -0.1992709 0.2439368 -0.0386717 -0.5863614 -0.0584998 -0.0907013 -0.1716076 -0.582258 -0.2364935 0.0702737 0.0960122 -0.2820734 -0.5652507 -0.1929394 -0.2388975 -0.0836203 -0.3200544 0.1334906 -0.0887139 -0.0060088 -0.2672692 -0.4946404 -0.2361402 0.1686129 -0.156194 -0.5057858 0.3122477 0.001059 0.2242157 -0.2986102 0.3364438 0.2220638 -0.0068511 0.2610472 -0.0356262 0.0145717 -0.0708683 0.0190678 -0.1084524 0.1000501 0.1188207 -0.0458944 -0.0546074 0.0333035 0.0236025 0.022604 0.0708588 0.0489788 0.0448453 -0.074635 -0.0100644 -0.1729531 0.3702698 -0.5634092 0.2083854 -0.5904636 0.118534 -0.1723764 -0.0895745 0.0474179 -0.1596632 0.0113618 -0.0998348 0.0859347 -0.1038662 -0.0259489 0.0557234 -0.0418481 0.0679717 0.0633307 0.0090004 -0.1073798 0.0096499 -0.1134514 -0.0368405 0.1725014 0.1393459 0.1598525 0.1526785 -0.1629302 -0.0969751 -0.0225 0.0853005 0.1855787 0.1847673 0.1558732 0.0924539 -0.0397331 0.2187871 -0.0213877 0.1772094 -0.2106755 0.0554425 0.002481 -0.0013626 0.0717362 -0.0146063 -0.0004962 -0.0983403 0.0527854 -0.1070866 -0.0627467 -0.0456866 0.1383713 -0.0428021 0.163062 -0.0475659 -0.0522085 -0.0852757 -0.0445481 -0.1369526 0.0905983 -0.0193923 -0.0085093 0.0266326 0.0231847 0.1037481 -0.0418892 0.0946791 0.0894116 0.0918224 0.0254505 -0.0397658 -0.0148248 0.0321372 0.0949369 -0.0120913 0.0999175 0.0892287 0.1608667 -0.0134873 -0.0607061 -0.0543805 0.0021463 0.0848723 -0.069944 -0.0067038 0.1338572 0.0024957 0.0536899 0.0507487 0.1105264 0.0917494 -0.0865426 0.1159989 -0.0954315 -0.0214804 -0.0814599 -0.0874043 -0.1585233 -0.1075179 0.0669603 -0.0211796 -0.0102705 -0.015016 -0.0450816 -0.0891794 -0.147958 -0.055256 -0.0101789 -0.0005943 0.0205527 -0.1044717 0.0167352 0.044692 0.0236477 0.0676468 0.0558705 0.1192516 -0.0928252 -0.0610016 0.0706582 -0.0707623 0.081456 0.106868 -0.0445655 -0.0113728 -0.0287265 0.0997924 -0.0116169 -0.0482709 0.0762127 -0.1143158 -0.0925305 0.024692 -0.0781252 0.0178262 0.1060512 0.045129 -0.0778995 0.0452728 0.1083395 -0.0497133 -0.1006243 0.0229226 -0.1098217 0.0438699 0.0575708 0.0200821 0.0560595 0.128761 unknown
polarizability: 233.4256474|4.2082735|143.0614455|2.4380275|-20.9045207|102.5565625 unknown
InChI: InChI=1S/C9H10N2OS2/c1-11(2)14(12)9-10-7-5-3-4-6-8(7)13-9/h3-6H,1-2H3
charge 0 multiplicity 1
24 atoms
S  -2.563159 -0.46086 -1.005029
S  0.048616 -1.599195 0.482863
O  -2.922127 -1.866069 -0.21347
N  -3.301867 0.893191 0.144741
N  0.077192 0.622817 -1.075362
C  1.595225 -0.668116 0.258255
C  1.399405 0.46757 -0.599637
C  -0.702668 -0.324094 -0.621724
C  2.861399 -0.956369 0.806555
C  2.485449 1.32021 -0.909316
C  -3.097669 0.534526 1.563354
C  -2.820775 2.236404 -0.254346
C  3.934596 -0.095098 0.488514
C  3.748686 1.03102 -0.360605
H  3.017129 -1.820746 1.458917
H  2.323433 2.180022 -1.565862
H  -3.228597 -0.559802 1.666007
H  -3.887626 1.029295 2.157143
H  -2.101035 0.829051 1.960874
H  -1.761545 2.436468 0.017332
H  -3.463915 2.980871 0.250009
H  -2.938019 2.3669 -1.344556
H  4.92702 -0.301539 0.903125
H  4.600952 1.678943 -0.589982
