program: Gaussian 09
title: 000117979
version: EM64L-G09RevD.01
frameworkgroup: C1[X(C8H16O3S)]
method: RPBEPBE
basis: SDD
operation: Freq
keyword: #p
keyword: freq=noraman
keyword: PBEPBE/SDD
title: #p freq=noraman PBEPBE/SDD
converged: YES YES NO NO
title: Mulliken charges:
elementType: S O O O C C C C C C C C H H H H H H H H H H H H H H H H
charge: -0.013334 -0.269238 -0.252468 -0.245848 -0.372228 -0.346832 -0.248601 -0.241534 -0.685066 -0.274026 0.358410 -0.794063 0.209268 0.207198 0.180319 0.186838 0.191781 0.192778 0.186260 0.203300 0.211896 0.212313 0.216562 0.221263 0.253186 0.287685 0.293907 0.130274
chargesum: 0.00000
title: Mulliken charges with hydrogens summed into heavy atoms:
elementType: S O O O C C C C C C C C
charge: 0.116940 -0.269238 -0.252468 -0.245848 0.044238 0.037726 0.118556 0.148026 -0.044295 0.200423 0.358410 -0.212470
polarizability: 1.50916923e+02 1.03414672e+00 9.99226763e+01 -3.54457501e+00 3.80404514e+00 9.31122426e+01
1716.lowfreq: -4.1773 -2.6507 -0.0016 -0.0009 -0.0009 8.0045 14.0237 21.1995 24.3271
frequency: 13.4091 21.1858 24.0603 43.3916 68.0351 92.8340 113.5137 119.7469 145.1390 185.9523 224.2248 232.9600 242.8307 254.8734 263.3581 353.6071 384.9187 429.4447 505.8233 548.7590 675.9763 693.0884 741.4435 800.5166 809.3245 810.7031 823.3538 902.2803 923.7795 936.7200 975.1161 989.6852 1012.9424 1036.5720 1070.8601 1083.8895 1110.4548 1117.2692 1128.2976 1149.3804 1197.2941 1202.5329 1212.0339 1248.3455 1271.0333 1273.4476 1282.4920 1283.7081 1337.5813 1351.5371 1365.2769 1390.4226 1411.8441 1430.7879 1451.6469 1460.7489 1470.0947 1474.7996 1477.1780 1484.4616 1492.3189 1636.6986 2431.2858 2905.8387 2924.4563 2954.7783 2965.3765 2975.3876 2976.8769 2992.3325 3008.8557 3024.5101 3040.3094 3055.4627 3073.6949 3075.7011 3095.5314 3137.5501
redmass: 4.8966 4.2851 8.6442 1.6593 3.9708 3.6648 1.8686 4.1941 4.0582 3.1688 2.1834 1.1061 2.0626 2.6506 2.1931 4.0237 3.5540 2.7796 3.2030 3.5862 4.8438 2.7998 1.0731 2.5124 1.2398 1.7228 2.9217 1.7336 4.8995 1.1766 1.6104 3.5707 2.5356 3.0214 3.4384 2.2299 2.6084 1.8801 2.4843 1.4795 1.2392 1.2594 1.3505 1.1047 1.2815 1.1780 1.4899 1.0840 1.3044 1.4514 1.4934 1.2152 1.5398 1.0949 1.0820 1.0855 1.0702 1.0665 1.0422 1.0690 1.0903 10.2660 1.0377 1.0550 1.0578 1.1052 1.0589 1.0363 1.1014 1.0592 1.1006 1.0595 1.0622 1.1039 1.1012 1.0995 1.1065 1.1010
irintensity: 0.9041 1.5740 1.9621 0.4824 1.0317 0.2872 1.8396 2.7818 6.8307 5.3608 26.4369 0.1678 2.0366 13.0822 21.8419 2.9090 1.1410 5.9021 11.4571 5.7694 5.2867 9.0833 9.3166 5.4520 2.0148 3.3332 9.8007 14.1330 21.2943 0.5741 4.2477 60.8853 33.2988 4.8815 120.4799 16.9359 19.2358 227.5541 2.1763 4.1659 43.1430 93.4520 2.8389 4.8970 0.2288 0.5424 96.5572 2.4396 14.5535 15.2860 12.8670 8.5065 0.6077 22.5352 16.2802 14.8961 0.0206 2.1257 12.8765 4.6930 13.6163 166.9082 8.2332 48.4427 86.4915 55.9112 39.0538 32.4597 36.0214 40.3186 7.6463 25.3954 9.8398 22.7815 98.8474 52.0938 17.9816 1.1337
temp: 298.150 k
press: 1.00000 atm
elementType: 16 8 8 8 6 6 6 6 6 6 6 6 1 1 1 1 1 1 1 1 1 1 1 1 1 1 1 1
symmnumber: 1
zpe: 603539.7 jmol-1
zpe.correction: 0.229876 hartree
zpe.thermalcorrener: 0.245578 hartree
zpe.thermalcorrenthalpy: 0.246522 hartree
zpe.thermalcorrgfe: 0.182176 hartree
zpe.sumelectzpe: -937.166689 hartree
zpe.sumelectthermal: -937.150987 hartree
zpe.sumelectthermalent: -937.150043 hartree
zpe.sumelectthermalfe: -937.214389 hartree
dipole: 3.5384 0.8051 -1.2784
dipole: 3.8474
quadrupole: -88.2180 -76.5875 -83.0239
quadrupole: 2.0659 -3.2861 -3.5087
quadrupole: -5.6082 6.0223 -0.4141 2.0659 -3.2861 -3.5087
hfenergy: -937.3965651 hartree
pointgroup: C01 [X(C8H16O3S1)]
dipole: -1.3818851 -0.4625135 -0.409579 debye
polarizability: 150.7648897|4.1882344|98.9399265|1.9649548|-4.5874549|94.2470256 unknown
InChI: InChI=1S/C8H16O3S/c1-2-3-4-10-5-6-11-8(9)7-12/h12H,2-7H2,1H3
charge 0 multiplicity 1
28 atoms
S  5.238481 1.44016 -0.739165
O  -1.193417 -0.670157 0.237712
O  1.718702 -0.256674 -0.326756
O  3.422602 -0.316316 1.26418
C  -3.3963 0.343486 0.27849
C  -4.821087 0.398518 -0.319994
C  -2.519053 -0.714139 -0.396678
C  -0.269256 -1.653439 -0.324038
C  -5.705033 1.466462 0.35966
C  1.088537 -1.446151 0.321896
C  2.884322 0.214656 0.26525
C  3.373113 1.466803 -0.442139
H  -2.904469 1.329978 0.175472
H  -3.450101 0.124358 1.362389
H  -2.963956 -1.729297 -0.27785
H  -2.421572 -0.50788 -1.486972
H  -5.302933 -0.59592 -0.221621
H  -4.757682 0.609226 -1.407189
H  -0.622602 -2.686667 -0.103032
H  -0.190008 -1.542239 -1.427576
H  -5.806702 1.265246 1.442584
H  -5.265234 2.47504 0.246267
H  -6.719924 1.488275 -0.077638
H  1.753132 -2.314665 0.164042
H  0.990192 -1.258112 1.404754
H  3.12339 2.347063 0.17417
H  2.898451 1.569239 -1.427517
H  5.561308 1.090144 0.5633
