program: Gaussian 09
title: 000117976
version: EM64L-G09RevD.01
frameworkgroup: C1[X(C8H20N2)]
method: RPBEPBE
basis: SDD
operation: Freq
keyword: #pfreq=noraman
keyword: PBEPBE/SDD
title: #p freq=noraman PBEPBE/SDD
converged: YES YES NO NO
title: Mulliken charges:
elementType: N N C C C C C C C C H H H H H H H H H H H H H H H H H H H H
charge: -0.110855 -0.543969 -0.363250 -0.375076 -0.338142 -0.317679 -0.313589 -0.413368 -0.676716 -0.673594 0.193093 0.193722 0.192794 0.186895 0.170898 0.216468 0.184213 0.207091 0.184305 0.200976 0.203088 0.200438 0.224652 0.207590 0.206003 0.224677 0.207147 0.205184 0.259222 0.257783
chargesum: 0.00000
title: Mulliken charges with hydrogens summed into heavy atoms:
elementType: N N C C C C C C C C
charge: -0.110855 -0.026963 0.023565 0.004612 0.049224 0.073626 0.071692 -0.009842 -0.038472 -0.036586
polarizability: 1.11461461e+02 -1.60892547e+00 1.01621753e+02 -1.14681500e+00 -3.68826546e-01 9.54498464e+01
1716.lowfreq: -13.0005 -9.6878 -7.2273 -0.0006 -0.0002 -0.0002 29.3214 43.2176 60.3871
frequency: 27.4293 42.8852 60.3353 78.9273 84.5083 130.4026 162.3113 190.8629 205.5236 246.1470 263.3059 289.1535 294.7212 341.0912 412.0486 430.9887 461.1870 514.5819 635.7983 698.0574 743.1294 791.0618 795.7826 822.4339 866.9902 917.1794 935.5260 996.7075 1007.1287 1043.2257 1062.6421 1073.0969 1082.7181 1086.0292 1089.9078 1102.3505 1122.4067 1188.1220 1203.4792 1241.9951 1254.4567 1279.6140 1282.3961 1289.8537 1292.6058 1333.1134 1345.8086 1351.4792 1360.4650 1364.9391 1374.7364 1385.5539 1386.1504 1456.6745 1459.1489 1459.5870 1461.8757 1471.8631 1475.8573 1477.9793 1481.8228 1486.5385 1490.8909 1643.6676 2843.0130 2845.0022 2860.0207 2954.4583 2964.4955 2976.1140 2981.3324 2982.3630 3003.3254 3017.0128 3026.6025 3031.9078 3034.8521 3047.6490 3073.4022 3074.8743 3089.4702 3090.6963 3439.5749 3564.0985
redmass: 3.1171 2.8414 1.7192 1.9534 2.1464 2.1127 3.0173 1.3101 1.2246 1.1303 2.1180 1.9766 2.1074 2.4473 2.2563 2.6577 2.5184 2.7539 1.5002 2.1339 1.1972 1.1655 1.1393 1.3659 1.8151 2.0162 1.6863 1.3162 3.2944 2.3338 2.4932 1.9369 2.2506 2.0748 3.0952 1.9273 1.6738 1.9827 2.2465 1.3839 1.4265 1.1104 1.1466 1.2690 1.1980 1.1893 1.3143 1.5239 1.3239 1.3092 1.3612 1.2386 1.2367 1.0706 1.0705 1.0720 1.0550 1.0596 1.0736 1.0684 1.0698 1.0708 1.0762 1.0877 1.0723 1.0719 1.0709 1.0630 1.0597 1.0608 1.0357 1.0357 1.0943 1.0985 1.0870 1.0918 1.0873 1.1039 1.0985 1.0979 1.1001 1.1002 1.0445 1.0967
irintensity: 0.1454 1.4303 3.8657 0.1867 0.0975 0.5785 4.5505 0.5470 0.3285 55.8263 4.6024 1.2485 0.8524 1.5595 12.5553 2.4460 3.8919 10.7710 327.0403 7.4555 6.5002 6.1066 4.2444 3.3149 6.0362 1.3611 2.5397 2.4717 5.9834 26.0822 20.8636 13.9652 2.0179 18.1284 24.5721 5.6078 2.1366 25.0569 20.5341 13.1698 7.5283 2.7816 1.7052 14.3918 18.8347 0.2618 5.0588 4.9169 8.2492 3.7738 0.8723 21.1226 21.9430 0.3500 1.8555 4.6021 4.4034 2.9501 2.5876 11.7777 10.5856 15.1672 13.3367 29.9725 34.9065 28.9917 281.4571 11.4383 27.1155 90.1593 37.1706 28.5941 9.8112 7.7385 8.0889 28.5304 18.1862 115.4693 38.1712 86.3387 36.5606 51.0794 1.8957 0.0008
temp: 298.150 k
press: 1.00000 atm
elementType: 7 7 6 6 6 6 6 6 6 6 1 1 1 1 1 1 1 1 1 1 1 1 1 1 1 1 1 1 1 1
symmnumber: 1
zpe: 719610.7 jmol-1
zpe.correction: 0.274085 hartree
zpe.thermalcorrener: 0.287937 hartree
zpe.thermalcorrenthalpy: 0.288881 hartree
zpe.thermalcorrgfe: 0.232486 hartree
zpe.sumelectzpe: -425.454716 hartree
zpe.sumelectthermal: -425.440864 hartree
zpe.sumelectthermalent: -425.439919 hartree
zpe.sumelectthermalfe: -425.496315 hartree
dipole: 1.9376 0.8077 0.4965
dipole: 2.1571
quadrupole: -75.1314 -63.2922 -63.7670
quadrupole: -4.9458 -1.3954 -0.7458
quadrupole: -7.7345 4.1047 3.6299 -4.9458 -1.3954 -0.7458
hfenergy: -425.7288008 hartree
pointgroup: C01 [X(C8H20N2)]
dipole: 0.7947282 0.2587134 0.1474118 debye
polarizability: 110.8496667|-3.039818|101.545446|0.1102005|-2.1510923|96.137948 unknown
InChI: InChI=1S/C8H20N2/c1-3-10(4-2)8-6-5-7-9/h3-9H2,1-2H3
charge 0 multiplicity 1
30 atoms
N  1.312276 -0.127745 0.257765
N  -3.93423 0.308997 -1.319354
C  0.506361 0.626199 1.257354
C  -0.9840 0.2134 1.272155
C  -1.717464 0.546314 -0.045311
C  1.683046 -1.485155 0.743757
C  2.486209 0.642739 -0.234659
C  -3.179558 0.02785 -0.07774
C  1.953813 -2.483206 -0.398678
C  2.105148 1.740515 -1.246787
H  0.936765 0.517734 2.285798
H  0.566076 1.701902 1.005784
H  -1.481426 0.725336 2.12253
H  -1.06936 -0.87429 1.473988
H  -1.72012 1.646703 -0.200655
H  -1.144929 0.107791 -0.886365
H  2.56812 -1.444116 1.43003
H  0.840355 -1.867523 1.348763
H  3.063172 1.093343 0.613959
H  3.171145 -0.067258 -0.733191
H  -3.180506 -1.06912 0.079376
H  -3.747478 0.461146 0.769509
H  1.064146 -2.566542 -1.046887
H  2.805145 -2.170089 -1.030158
H  2.191605 -3.483412 0.009761
H  1.584958 1.293232 -2.111755
H  1.433827 2.498144 -0.803077
H  3.009954 2.264996 -1.607496
H  -3.53161 -0.140705 -2.149214
H  -4.090237 1.309619 -1.484202
