program: Gaussian 09
title: 000117815
version: EM64L-G09RevD.01
frameworkgroup: C1[X(C11H27N3)]
method: RPBEPBE
basis: SDD
operation: Freq
keyword: #pfreq=noraman
keyword: PBEPBE/SDD
title: #p freq=noraman PBEPBE/SDD
converged: YES YES NO NO
title: Mulliken charges:
elementType: N N N C C C C C C C C C C C H H H H H H H H H H H H H H H H H H H H H H H H H H H
charge: -0.636781 -0.570936 -0.570958 -0.013438 -0.406543 -0.408208 -0.387237 -0.386494 -0.378501 -0.378533 -0.359048 -0.358945 -0.396013 -0.396078 0.179518 0.178451 0.215108 0.215368 0.178635 0.196158 0.183675 0.196352 0.183018 0.194510 0.189030 0.189086 0.194549 0.180943 0.217523 0.180952 0.217546 0.264287 0.264184 0.206353 0.178652 0.206374 0.178664 0.271392 0.257974 0.257975 0.271434
chargesum: 0.00000
title: Mulliken charges with hydrogens summed into heavy atoms:
elementType: N N N C C C C C C C C C C C
charge: -0.108311 -0.041569 -0.041549 0.166080 -0.012984 -0.014205 -0.007404 -0.007123 0.005040 0.005102 0.039419 0.039553 -0.011008 -0.011040
polarizability: 1.91701319e+02 -1.20115515e-02 1.26674276e+02 2.18523825e-02 -9.63988751e-01 1.11972572e+02
1716.lowfreq: -0.0015 -0.0012 0.0005 5.5124 7.9324 20.5259 27.0018 35.3026 48.4284
frequency: 24.8566 34.6136 48.4014 51.1480 59.2352 79.0751 91.6195 107.1961 122.6980 123.5682 149.5393 150.2610 154.4798 174.0251 219.1533 230.9617 239.4021 246.1799 287.0399 330.7568 381.9970 441.4663 446.9974 450.6808 509.8926 540.8084 608.3668 608.4995 612.2593 729.5662 733.7967 756.5379 766.3757 824.4417 828.2521 885.3190 926.2782 943.2805 953.2740 978.0652 982.4832 1019.9668 1022.7671 1042.0175 1053.7812 1054.4684 1076.6448 1080.3543 1090.6419 1093.0910 1117.2482 1118.7169 1138.0434 1156.0469 1193.8648 1208.4248 1209.7306 1235.9436 1238.6002 1245.7057 1262.4414 1279.8829 1283.9325 1285.1892 1286.1073 1290.1839 1299.9992 1300.5236 1307.4457 1330.1904 1345.9642 1353.8011 1355.7778 1363.4038 1376.5547 1388.3338 1388.3996 1441.6169 1451.4493 1463.8768 1464.0317 1465.5541 1465.9760 1480.3598 1480.6802 1493.4381 1493.4959 1639.2194 1639.2553 1640.1396 2822.1492 2860.6567 2860.7124 2948.2751 2949.0119 2953.2112 2953.4350 2959.9829 2960.5478 2964.8749 2970.0672 2987.4230 2987.7993 3004.9791 3005.2607 3010.4882 3011.7810 3031.5989 3037.5077 3045.7870 3047.6627 3449.0231 3449.0962 3459.2552 3576.3603 3576.4341 3580.5711
redmass: 4.2959 3.4608 2.5499 1.9349 2.0279 3.7196 3.0555 1.8598 2.1767 1.8282 1.9238 2.9543 2.5146 4.3546 1.5672 1.2317 1.1479 1.8002 2.8044 3.0149 3.2657 2.3646 2.8382 3.4060 2.3935 2.5502 1.2853 1.2848 1.3232 1.0857 1.0817 1.1334 1.1670 1.2299 1.5245 1.7953 1.4813 2.2620 2.0568 2.2518 1.4956 3.6310 2.5777 2.1230 1.4611 2.6654 2.2478 2.2582 2.4494 2.1504 2.0671 1.8462 2.6702 1.8109 1.3755 1.3930 1.5075 1.2997 1.2939 1.3503 1.3475 1.1122 1.0765 1.1693 1.0903 1.2692 1.1148 1.1180 1.2772 1.3555 1.4204 1.4536 1.5901 1.4784 1.8209 1.4733 1.4690 1.0845 1.0818 1.0657 1.0659 1.0865 1.0871 1.0967 1.0968 1.0902 1.0902 1.0942 1.0942 1.0973 1.0805 1.0716 1.0716 1.0580 1.0583 1.0617 1.0616 1.0622 1.0624 1.0596 1.0590 1.0967 1.0967 1.0875 1.0867 1.0983 1.0994 1.1030 1.1017 1.1025 1.1026 1.0448 1.0448 1.0447 1.0973 1.0973 1.0964
irintensity: 0.0250 0.5538 2.4489 0.6022 8.0676 0.0766 0.0644 6.6915 0.8377 2.8459 14.0945 1.1415 1.0027 0.1112 38.9731 22.7902 71.6592 49.4113 3.0293 5.0200 1.8096 10.8171 17.7417 20.8662 4.8960 3.2285 188.4195 234.8511 175.7685 0.1385 32.2469 0.4004 1.0148 0.0131 2.7652 0.8104 0.3314 1.4029 0.1570 0.0745 4.4817 0.6250 0.0086 15.1434 0.1669 0.0926 0.1114 2.0578 3.4606 5.3945 4.3687 39.5789 5.6884 4.7739 9.0438 1.2163 0.6648 0.5596 9.9516 0.2192 2.2427 1.6362 3.4078 1.0553 0.4306 7.1970 1.9989 1.0835 0.3337 1.1195 5.7893 9.0046 0.4692 4.0421 7.1138 28.6152 8.0262 0.6642 5.0432 0.0167 0.3414 0.0700 0.2541 0.6350 18.7041 4.5678 7.4978 50.1959 28.1049 74.3363 86.9302 10.2081 216.6376 0.4810 8.1272 3.4999 4.0100 3.9130 100.9407 1.1697 157.2816 0.1008 0.0994 2.7483 76.4371 0.0613 2.7861 0.0430 0.7921 4.4145 352.7038 2.3878 2.2742 2.6777 0.1662 0.1604 0.0109
temp: 298.150 k
press: 1.00000 atm
elementType: 7 7 7 6 6 6 6 6 6 6 6 6 6 6 1 1 1 1 1 1 1 1 1 1 1 1 1 1 1 1 1 1 1 1 1 1 1 1 1 1 1
symmnumber: 1
zpe: 985783.2 jmol-1
zpe.correction: 0.375465 hartree
zpe.thermalcorrener: 0.395041 hartree
zpe.thermalcorrenthalpy: 0.395986 hartree
zpe.thermalcorrgfe: 0.325566 hartree
zpe.sumelectzpe: -598.395896 hartree
zpe.sumelectthermal: -598.376320 hartree
zpe.sumelectthermalent: -598.375376 hartree
zpe.sumelectthermalfe: -598.445795 hartree
dipole: 0.0179 -0.0169 1.3017
dipole: 1.3019
quadrupole: -76.0041 -85.6465 -98.3081
quadrupole: 0.0050 0.0179 -0.5683
quadrupole: 10.6488 1.0064 -11.6552 0.0050 0.0179 -0.5683
hfenergy: -598.7713611 hartree
pointgroup: C01 [X(C11H27N3)]
dipole: -0.0070255 -0.0529445 -0.5094294 debye
polarizability: 191.7013102|-0.0223269|126.7276812|0.0278085|-0.3759642|111.9191754 unknown
InChI: InChI=1S/C11H27N3/c12-9-5-1-3-7-11(14)8-4-2-6-10-13/h11H,1-10,12-14H2
charge 0 multiplicity 1
41 atoms
N  0.000339 1.835249 -0.631125
N  7.625386 -0.109178 0.453915
N  -7.629921 -0.10116 0.453299
C  -0.001837 0.506159 0.024323
C  1.271159 -0.274657 -0.380721
C  -1.275908 -0.271244 -0.383298
C  2.595539 0.366557 0.09344
C  -2.599748 0.370028 0.092312
C  3.829974 -0.516774 -0.199937
C  -3.834998 -0.511861 -0.201883
C  5.156886 0.11998 0.268319
C  -5.161134 0.125892 0.267459
C  6.386962 -0.765365 -0.015991
C  -6.392092 -0.758334 -0.016762
H  -0.002786 0.584637 1.144394
H  1.200077 -1.297184 0.044982
H  1.280782 -0.376472 -1.484395
H  -1.285315 -0.370408 -1.487278
H  -1.206289 -1.295128 0.039303
H  2.540374 0.565332 1.184729
H  2.742815 1.348557 -0.403363
H  -2.543953 0.56722 1.183862
H  -2.747014 1.353152 -0.402479
H  3.878658 -0.723853 -1.289555
H  3.698784 -1.500654 0.297863
H  -3.70463 -1.496343 0.294865
H  -3.884246 -0.717646 -1.291696
H  5.289601 1.10141 -0.236516
H  5.121919 0.327013 1.355531
H  -5.293227 1.10762 -0.236888
H  -5.125353 0.332279 1.354737
H  -0.849316 2.383036 -0.463821
H  0.844254 2.387475 -0.450032
H  6.276832 -1.719611 0.53549
H  6.395489 -1.024074 -1.104868
H  -6.282751 -1.712697 0.53466
H  -6.400913 -1.016968 -1.105654
H  8.456758 -0.708117 0.436264
H  7.802451 0.798096 0.009484
H  -7.806795 0.805914 0.008395
H  -8.461611 -0.699677 0.436638
