program: Gaussian 09
title: 000014432
version: EM64L-G09RevD.01
frameworkgroup: C1[X(C18H20N2O6)]
method: RPBEPBE
basis: SDD
operation: Freq
keyword: #p
keyword: freq=noraman
keyword: PBEPBE/SDD
title: #p freq=noraman PBEPBE/SDD
converged: YES YES NO NO
title: Mulliken charges:
elementType: O O O O O O N N C C C C C C C C C C C C C C C C C C H H H H H H H H H H H H H H H H H H H H
charge: -0.400357 -0.400352 -0.441652 -0.441832 -0.239635 -0.239610 -0.360998 -0.361217 -0.372971 -0.373798 -0.259591 -0.259918 0.446571 0.446943 0.140445 0.140548 0.189822 0.189777 -0.405860 -0.406024 -0.393687 -0.393670 -0.258427 -0.258514 -0.211717 -0.211658 0.239745 0.172293 0.172629 0.239681 0.225750 0.225904 0.292949 0.293072 0.232896 0.232957 0.214514 0.214546 0.226722 0.226731 0.226045 0.226029 0.379576 0.379592 0.357857 0.357895
chargesum: 0.00000
title: Mulliken charges with hydrogens summed into heavy atoms:
elementType: O O O O O O N N C C C C C C C C C C C C C C C C C C
charge: -0.020781 -0.020760 -0.083796 -0.083937 -0.239635 -0.239610 -0.068049 -0.068145 0.039067 0.038512 -0.033841 -0.034014 0.446571 0.446943 0.140445 0.140548 0.189822 0.189777 -0.172964 -0.173067 -0.179174 -0.179124 -0.031705 -0.031783 0.014328 0.014370
polarizability: 1.98101219e+02 -5.99052143e-02 2.49648241e+02 1.53832622e+01 3.09410480e-02 2.17640903e+02
1716.lowfreq: -1.3426 -0.0007 -0.0007 -0.0005 3.4457 6.9146 10.9782 12.7394 30.0301
frequency: 10.8555 12.7256 30.0068 34.6363 45.0077 69.6694 76.7563 77.3012 82.0970 103.5058 117.5964 119.7894 142.4289 145.3160 150.6344 182.9081 190.1890 228.6113 242.5959 275.7665 298.0928 307.8384 313.4430 329.0427 339.7391 369.7489 377.9199 390.9402 402.7787 442.4379 462.2377 492.1339 499.5939 510.4081 522.1395 535.4282 535.9522 559.8515 572.0746 592.6256 595.9236 606.3538 615.0972 625.3603 625.9798 679.6818 686.0802 742.4602 744.4232 750.6918 751.8734 762.4533 762.9429 826.4188 842.6897 842.8770 859.9878 862.3869 902.4075 910.7562 933.1007 933.9300 969.6659 969.7357 1006.0073 1034.1897 1039.0658 1044.0419 1072.1781 1072.2846 1082.2785 1084.5515 1114.3046 1128.9577 1148.5385 1149.2319 1161.4353 1171.0752 1171.0849 1171.7940 1188.3829 1215.4473 1220.1798 1238.7572 1246.5222 1247.0411 1254.6648 1271.6869 1276.0954 1277.0572 1305.9878 1321.0923 1325.3833 1327.8129 1347.0159 1394.2324 1396.8830 1397.8343 1436.0827 1436.4615 1462.4248 1463.4650 1485.6123 1494.6134 1495.0250 1496.2021 1605.2915 1605.3632 1614.6072 1614.6429 1655.3518 1655.7735 2822.0387 2827.5469 2832.5943 2833.5497 3022.2471 3037.6637 3111.0295 3111.1695 3118.1886 3118.5516 3141.8208 3141.8301 3165.7911 3165.8288 3467.8568 3468.5508 3520.0958 3520.2538 3587.5637 3587.6765
redmass: 6.1175 6.0717 5.1205 6.1993 5.5873 6.4435 6.0283 6.7916 8.0486 4.4296 6.2432 2.0751 4.6009 4.9857 5.4441 4.7264 5.7809 5.9035 4.5570 4.0763 1.7737 1.1590 1.8106 6.9668 6.1314 3.6118 3.7629 3.8598 4.4971 3.5073 3.4926 2.8887 2.3999 2.3850 3.8809 6.5875 6.6222 2.3048 1.7475 1.9997 3.7135 1.8581 4.6582 1.9997 2.0676 4.5722 4.6748 3.1399 3.3632 1.3918 1.3444 4.9368 5.0699 1.1763 1.4479 1.4464 6.0624 5.8886 3.9957 3.4442 1.4552 1.5288 1.3221 1.3209 3.0630 2.6346 2.1523 2.5151 2.3075 2.3060 2.0306 2.4073 2.8912 2.1585 1.2771 1.3019 2.6943 1.0980 1.1158 2.4121 1.4548 2.3647 1.6705 1.3164 2.4835 2.5220 1.5946 1.3814 1.2281 1.5340 1.6540 1.6587 1.3700 1.5818 1.5659 1.8752 7.1336 3.6086 2.0971 2.1235 1.4234 1.4118 1.0741 1.9442 2.6330 1.2846 6.5787 6.5878 6.7624 6.7604 8.8660 8.8672 1.0726 1.0723 1.0782 1.0781 1.0832 1.0903 1.0882 1.0882 1.0894 1.0893 1.0917 1.0917 1.1001 1.1001 1.0750 1.0750 1.0640 1.0640 1.0662 1.0662
irintensity: 0.0049 0.1670 0.2667 0.7571 0.0147 0.5524 0.4028 1.1178 0.7803 3.4643 0.1137 1.3457 0.8703 0.0543 7.3861 2.4964 2.0941 0.5933 21.8546 0.3131 94.7455 8.6455 116.2157 1.0828 1.2103 0.5714 54.1569 0.0152 29.5074 31.6614 0.0397 27.6454 10.8543 13.0008 4.5596 9.8065 1.6986 54.5436 3.1841 6.5929 9.9074 83.1527 26.1165 178.2829 124.0127 25.8685 19.3594 4.3169 2.3219 176.4630 5.2217 0.3854 14.5032 0.1805 0.0255 0.4484 13.9999 42.4328 13.7481 3.6288 0.5270 2.6989 0.3764 0.0289 257.3813 4.8260 13.0969 3.5160 207.8501 17.1294 262.6195 7.5920 3.8461 115.1327 61.5883 25.0992 13.5627 5.2943 7.0428 48.8429 1.6025 35.3729 11.8386 15.0098 3.5336 35.0984 0.4698 97.5581 13.9319 0.3344 48.0392 12.8701 43.2379 0.4986 38.6148 1.0627 23.4142 0.0424 56.3496 1.2408 5.3253 76.4391 0.9879 34.9129 18.6064 10.0501 6.7346 19.0751 0.7145 5.2548 260.6152 251.3398 145.1384 57.3546 101.1249 78.6208 8.7274 38.9573 13.5886 17.5880 5.6020 5.8371 17.8216 20.3314 19.1077 28.4647 27.0593 16.7168 31.8693 24.1012 33.2627 30.6625
temp: 298.150 k
press: 1.00000 atm
elementType: 8 8 8 8 8 8 7 7 6 6 6 6 6 6 6 6 6 6 6 6 6 6 6 6 6 6 1 1 1 1 1 1 1 1 1 1 1 1 1 1 1 1 1 1 1 1
symmnumber: 1
zpe: 933218.6 jmol-1
zpe.correction: 0.355444 hartree
zpe.thermalcorrener: 0.381003 hartree
zpe.thermalcorrenthalpy: 0.381947 hartree
zpe.thermalcorrgfe: 0.296394 hartree
zpe.sumelectzpe: -1256.824657 hartree
zpe.sumelectthermal: -1256.799099 hartree
zpe.sumelectthermalent: -1256.798155 hartree
zpe.sumelectthermalfe: -1256.883707 hartree
dipole: -0.0048 3.5080 0.0041
dipole: 3.5080
quadrupole: -129.4596 -142.6080 -140.1067
quadrupole: -0.0237 8.5899 0.0096
quadrupole: 7.9318 -5.2166 -2.7153 -0.0237 8.5899 0.0096
hfenergy: -1257.1801015 hartree
pointgroup: C01 [X(C18H20N2O6)]
dipole: 0.0049345 0.0278668 1.3798626 debye
polarizability: 196.1160146|-13.9188459|219.6397511|0.4425231|0.6303614|249.634597 unknown
InChI: InChI=1S/C18H20N2O6/c21-13-7-3-1-5-11(13)15(17(23)24)19-9-10-20-16(18(25)26)12-6-2-4-8-14(12)22/h1-8,15-16,19-23,25H,9-10H2
charge 0 multiplicity 1
46 atoms
O  5.461483 -0.267167 -1.847986
O  -5.47118 0.197896 -1.83298
O  3.971439 -2.01826 0.334908
O  -3.968206 2.029824 0.276876
O  3.897549 -1.584842 -2.942798
O  -3.911745 1.475233 -2.980801
N  1.81197 -0.502989 -1.487873
N  -1.819843 0.44376 -1.49862
C  0.646009 0.384384 -1.426532
C  -0.653937 -0.441564 -1.413671
C  3.126841 0.124962 -1.32423
C  -3.134637 -0.175551 -1.304888
C  3.49243 0.328096 0.147451
C  -3.492489 -0.322447 0.17547
C  4.160945 -0.69394 -2.106454
C  -4.171723 0.615057 -2.111878
C  3.856782 -0.770741 0.969635
C  -3.850956 0.807046 0.95773
C  3.405164 1.604157 0.743401
C  -3.401736 -1.57502 0.818711
C  4.110029 -0.598017 2.348084
C  -4.095709 0.686917 2.343259
C  3.656015 1.79647 2.122559
C  -3.6438 -1.714692 2.205755
C  4.005311 0.688451 2.924595
C  -3.987651 -0.576864 2.967347
H  0.68763 0.984325 -0.49896
H  0.608704 1.113071 -2.280087
H  -0.61766 -1.194529 -2.245866
H  -0.694022 -1.01447 -0.469078
H  3.161589 1.140259 -1.800912
H  -3.173655 -1.207917 -1.742866
H  1.80008 -1.202548 -2.240112
H  -1.811885 1.118177 -2.273482
H  3.135142 2.461712 0.114148
H  -3.135776 -2.455865 0.220758
H  4.392166 -1.458376 2.96963
H  -4.373677 1.570443 2.933364
H  3.578824 2.795902 2.562457
H  -3.563961 -2.696654 2.682937
H  4.200867 0.819046 3.99456
H  -4.176363 -0.666635 4.042737
H  6.095135 -0.81054 -2.389735
H  -6.10717 0.721528 -2.391161
H  4.201269 -2.730382 0.980833
H  -4.191293 2.766693 0.896868
