program: Gaussian 09
title: 000117763
version: EM64L-G09RevD.01
frameworkgroup: C1[X(C2Cl4N3P)]
method: RPBEPBE
basis: SDD
operation: Freq
keyword: #p
keyword: freq=noraman
keyword: PBEPBE/SDD
title: #p freq=noraman PBEPBE/SDD
converged: YES YES NO NO
title: Mulliken charges:
elementType: Cl Cl Cl Cl P N N N C C
charge: -0.042494 -0.041917 0.070145 0.070038 0.663730 -0.258730 -0.259033 0.134841 -0.168251 -0.168330
chargesum: 0.00000
title: Mulliken charges with hydrogens summed into heavy atoms:
polarizability: 1.49337123e+02 1.79769410e-02 1.21675367e+02 2.30346583e-02 -4.35100352e-03 7.89875058e+01
1716.lowfreq: -4.2638 -3.9171 -3.3003 -0.0043 -0.0043 -0.0041 53.6101 69.4878 132.8368
frequency: 53.6099 69.4877 132.8367 137.6327 142.3632 165.1613 194.2330 243.6485 279.0245 335.5317 370.8278 401.4604 469.1387 495.7660 595.8068 660.2048 684.3432 695.3969 755.5295 851.5275 1111.9285 1162.6447 1335.0210 1365.4653
redmass: 33.1763 26.1864 27.3284 32.7720 15.3328 15.0441 28.7113 19.3183 27.9010 25.8873 20.9572 16.1216 27.6194 21.2416 12.3088 15.7790 16.5579 12.7806 14.6467 14.5961 12.3086 12.8602 13.1919 12.6215
irintensity: 0.0000 1.4296 0.7400 1.8339 0.1414 0.0000 0.6550 0.0589 0.7933 7.8696 3.8202 0.9780 130.8535 167.8670 0.0006 70.6008 69.9398 7.1506 120.0626 15.0351 195.4547 113.6301 534.7156 624.2963
temp: 298.150 k
press: 1.00000 atm
elementType: 17 17 17 17 15 7 7 7 6 6
symmnumber: 1
zpe: 76014.3 jmol-1
zpe.correction: 0.028952 hartree
zpe.thermalcorrener: 0.039776 hartree
zpe.thermalcorrenthalpy: 0.040720 hartree
zpe.thermalcorrgfe: -0.010015 hartree
zpe.sumelectzpe: -2421.145169 hartree
zpe.sumelectthermal: -2421.134346 hartree
zpe.sumelectthermalent: -2421.133402 hartree
zpe.sumelectthermalfe: -2421.184137 hartree
dipole: 0.9284 0.0012 -0.0059
dipole: 0.9285
quadrupole: -95.6952 -97.9091 -90.4054
quadrupole: -0.0038 -0.0117 -0.0082
quadrupole: -1.0253 -3.2392 4.2645 -0.0038 -0.0117 -0.0082
hfenergy: -2421.1741217 hartree
pointgroup: C01 [X(C2Cl4N3P1)]
dipole: 0.3650733 -0.0016109 0.0123261 debye
dipolederiv: -0.5894177 -0.0080911 -0.3330136 -0.0094943 -0.1412969 -0.014735 -0.3550318 -0.014163 -0.6272572 -0.6431199 0.0144343 0.3317731 0.0155063 -0.1411369 -0.0170497 0.3518818 -0.0169249 -0.571531 -0.4242961 0.4641678 -0.0328637 0.4140412 -0.6697436 0.0396855 -0.0311492 0.0418644 -0.0122516 -0.4372981 -0.4688145 -0.0005303 -0.4183184 -0.6594893 0.0060211 -0.0019916 0.0046436 -0.0097511 2.4732237 -0.0123165 0.0263908 -0.0118396 0.6868185 0.0387429 0.0280198 0.0385574 1.8106153 -1.5613697 0.1597302 -0.0572133 -0.0162737 -0.3729358 0.0029654 -0.0505117 0.0101787 -0.2672658 -1.5622818 -0.145243 -0.0459821 0.0316286 -0.3704155 0.0047471 -0.0508781 -0.0023961 -0.2667408 -0.6320884 -0.0090721 -0.0215948 -0.0089498 -1.8581599 0.0614156 -0.0212034 0.0611992 -0.0780892 1.6839952 -0.3977352 0.0808018 -0.1842302 1.7667939 -0.0690274 0.0729418 -0.0777922 0.012232 1.692653 0.40294 0.0522321 0.1879298 1.7595654 -0.0527655 0.0579224 -0.0451671 0.0100394 unknown
polarizability: 149.2222262|-0.0744454|121.6245346|2.8318616|-1.4856356|79.1532347 unknown
InChI: InChI=1S/C2Cl4N3P/c3-1-7-2(4)9-10(5,6)8-1
charge 0 multiplicity 1
10 atoms
Cl 2.674041 0.043274 1.800073
Cl 2.809844 -0.074248 -1.578387
Cl -1.971495 2.6626 -0.171394
Cl -2.009985 -2.639493 0.011923
P  1.326461 -0.008055 0.052647
N  0.38052 1.439967 -0.034645
N  0.35987 -1.445113 0.062075
N  -1.643998 0.009626 -0.065109
C  -0.954073 1.17582 -0.078114
C  -0.971287 -1.164377 0.000831
