program: Gaussian 09
title: 000117706
version: EM64L-G09RevD.01
frameworkgroup: C1[X(C18H6Br4N2O)]
method: RPBEPBE
basis: SDD
operation: Freq
keyword: #p
keyword: freq=noraman
keyword: PBEPBE/SDD
title: #p freq=noraman PBEPBE/SDD
converged: NO YES NO YES
title: Mulliken charges:
elementType: Br Br Br Br O N N C C C C C C C C C C C C C C C C C C H H H H H H
charge: 0.120159 0.129623 0.135569 0.136196 -0.196110 -0.352785 0.054022 -0.052699 0.406625 0.423231 -0.051024 0.358912 0.062867 0.127599 0.485962 -0.376252 -0.409623 -0.429453 -0.375758 -0.468270 -0.452324 -0.220178 -0.180792 -0.185234 -0.219230 0.306483 0.264907 0.243495 0.245155 0.233519 0.235409
chargesum: 0.00000
title: Mulliken charges with hydrogens summed into heavy atoms:
elementType: Br Br Br Br O N N C C C C C C C C C C C C C C C C C C
charge: 0.120159 0.129623 0.135569 0.136196 -0.196110 -0.352785 0.054022 -0.052699 0.406625 0.423231 -0.051024 0.358912 0.062867 0.127599 0.485962 -0.069768 -0.409623 -0.429453 -0.110851 -0.224775 -0.207169 0.013341 -0.180792 -0.185234 0.016178
polarizability: 5.70657689e+02 2.88680024e+01 3.64815692e+02 -7.36406729e-03 -1.80951133e-02 9.82505428e+01
1716.lowfreq: -4.7879 -0.0004 0.0000 0.0006 2.6247 3.6122 24.4059 29.3579 42.0109
frequency: 24.4017 29.3502 42.0073 52.2446 76.8715 97.5974 131.2511 139.5095 141.0255 150.9683 180.5530 185.4179 196.6961 202.5581 212.2534 217.6823 264.6442 287.4382 295.1986 329.2619 370.7806 381.0481 425.8041 463.2259 473.2016 491.8440 498.7245 523.6766 547.2144 549.0272 581.3131 588.8024 628.2496 632.3552 652.4359 661.7748 686.4831 699.5851 731.6173 747.2428 775.6452 782.2274 783.4011 789.2433 809.7721 854.0633 865.6636 911.6139 912.8180 933.4230 986.0872 994.5464 1001.3933 1027.1601 1062.2021 1093.0603 1113.8466 1122.3349 1155.8604 1179.3587 1191.1269 1210.2043 1239.8978 1258.2140 1299.8574 1320.8590 1332.5310 1361.3608 1383.5284 1399.3606 1421.7853 1433.8051 1449.9443 1499.6873 1524.4476 1550.8607 1570.6973 1586.9317 1610.7131 1621.3465 1631.6338 3133.6385 3135.8718 3155.1178 3158.9177 3174.7257 3199.8904
redmass: 17.8741 8.2810 35.1374 10.7481 12.0575 10.2130 26.5431 60.5040 7.7237 78.2874 4.7841 18.8372 5.7724 12.2571 28.8535 37.6362 8.1318 5.6677 14.3454 9.4710 8.9233 8.5990 5.2210 8.2959 3.4330 8.4759 5.1595 10.6581 7.4117 8.3030 9.2570 8.3997 4.6320 12.0589 3.3671 10.5841 9.9742 10.5708 9.2761 10.1159 1.7397 5.6472 1.5166 8.0477 8.1620 2.5397 8.5421 10.7846 1.3706 1.4576 1.3404 1.3628 6.0058 4.1506 2.6395 2.4811 4.2376 6.0064 2.4969 1.2598 2.3520 1.7626 1.9245 4.2685 5.6007 7.6053 4.9812 5.9412 4.0844 5.6537 5.2570 2.5374 2.9897 4.4128 11.2803 11.7928 7.2834 6.0195 10.4672 7.9435 10.7296 1.0876 1.0872 1.0933 1.0965 1.0975 1.0946
irintensity: 0.2008 0.0033 0.0049 1.3186 0.3906 0.4578 0.3238 0.2023 0.0476 0.0012 1.7800 0.0580 2.3914 0.5294 2.6469 0.1838 6.2494 1.9158 0.9398 0.0516 0.2387 2.1136 0.8328 25.9246 0.0023 2.9784 0.9864 6.0467 0.2406 2.7969 0.0815 2.3084 3.4354 32.3881 0.1567 24.4032 0.0910 33.4365 8.7191 7.4237 32.8107 1.3679 22.5730 9.1345 0.0803 84.0542 1.9154 28.3632 0.6830 0.3519 0.0397 4.3976 2.9100 0.7836 42.4632 34.7129 27.8708 67.0434 9.5087 5.4386 103.1588 16.4883 17.1461 113.3166 24.0005 171.4115 95.2691 51.6219 113.7836 2.1609 2.4915 2.1548 40.4696 16.6225 3.6171 3.8552 33.1011 9.8532 137.1117 6.5246 170.2099 2.1053 1.3162 23.5066 37.9178 14.7843 1.3020
temp: 298.150 k
press: 1.00000 atm
elementType: 35 35 35 35 8 7 7 6 6 6 6 6 6 6 6 6 6 6 6 6 6 6 6 6 6 1 1 1 1 1 1
symmnumber: 1
zpe: 494069.8 jmol-1
zpe.correction: 0.188181 hartree
zpe.thermalcorrener: 0.208654 hartree
zpe.thermalcorrenthalpy: 0.209598 hartree
zpe.thermalcorrgfe: 0.135585 hartree
zpe.sumelectzpe: -926.437450 hartree
zpe.sumelectthermal: -926.416978 hartree
zpe.sumelectthermalent: -926.416033 hartree
zpe.sumelectthermalfe: -926.490046 hartree
dipole: -3.1429 -1.3503 0.0002
dipole: 3.4207
quadrupole: -143.3287 -176.3806 -182.8293
quadrupole: 1.3636 -0.0003 -0.0001
quadrupole: 24.1841 -8.8677 -15.3164 1.3636 -0.0003 -0.0001
hfenergy: -926.6256315 hartree
pointgroup: C01 [X(C18H6Br4N2O1)]
dipole: 1.242674 0.5166511 0.000071 debye
polarizability: 571.3084904|26.4381502|364.1648903|0.0075765|0.0180072|98.2505428 unknown
InChI: InChI=1S/C18H6Br4N2O/c19-13-11-12(14(20)16(22)15(13)21)18(25)24-9-6-2-4-7-3-1-5-8(10(7)9)23-17(11)24/h1-6H
charge 0 multiplicity 1
31 atoms
Br -1.961358 3.41581 0.000106
Br -3.710102 -3.102813 -0.000342
Br -5.227047 2.542489 -0.000018
Br -6.10723 -0.699993 -0.000275
O  -0.535639 -2.944102 -0.000269
N  0.434976 -0.7662 -0.000052
N  0.751782 1.645916 0.000113
C  -0.029018 0.592677 0.000056
C  1.832514 -1.052617 -0.0001
C  -1.502042 0.534472 0.000029
C  2.697711 0.095419 -0.000036
C  -1.882824 -0.840717 -0.000087
C  -0.650922 -1.691071 -0.000048
C  2.150451 1.432067 0.000087
C  4.125368 -0.092162 -0.00007
C  2.361868 -2.353154 -0.00019
C  -2.479549 1.550847 0.000037
C  -3.235595 -1.224825 -0.000201
C  3.006471 2.546519 0.000161
C  4.646962 -1.427195 -0.00017
C  4.967191 1.071261 0.000014
C  3.777814 -2.521662 -0.000226
C  -3.85384 1.171088 -0.000042
C  -4.230936 -0.206661 -0.000169
C  4.417273 2.358984 0.000125
H  1.693168 -3.215083 -0.000234
H  2.560556 3.545201 0.00025
H  5.732323 -1.575832 -0.000205
H  6.0545 0.933542 -0.00002
H  4.182022 -3.539416 -0.000311
H  5.07545 3.233914 0.000188
