program: Gaussian 09
title: 000117690
version: EM64L-G09RevD.01
frameworkgroup: C1[X(C4H9Cl2P)]
method: RPBEPBE
basis: SDD
operation: Freq
keyword: #p
keyword: freq=noraman
keyword: PBEPBE/SDD
title: #p freq=noraman PBEPBE/SDD
converged: YES YES NO NO
title: Mulliken charges:
elementType: Cl Cl P C C C C H H H H H H H H H
charge: -0.222350 -0.222003 0.490109 -0.216261 -0.652494 -0.652189 -0.630399 0.222405 0.231182 0.249282 0.248421 0.222554 0.231391 0.243600 0.213263 0.243489
chargesum: 0.00000
title: Mulliken charges with hydrogens summed into heavy atoms:
elementType: Cl Cl P C C C C
charge: -0.222350 -0.222003 0.490109 -0.216261 0.050374 0.050177 0.069954
polarizability: 9.51478056e+01 -8.15406762e-02 1.00024818e+02 3.14045432e+00 1.03040117e-02 6.87452477e+01
1716.lowfreq: -19.5751 -14.8966 -0.0046 -0.0040 -0.0035 16.9405 72.0109 131.7708 135.5942
frequency: 71.8992 131.7475 135.5936 172.5996 188.1841 237.1916 245.3649 261.6155 276.5580 339.6039 378.2705 382.5956 441.2997 442.0077 523.1576 782.4186 937.4355 943.5505 957.8986 1002.3618 1014.9868 1172.9609 1206.7756 1224.0623 1379.3623 1380.3965 1406.9435 1451.6406 1462.2490 1466.3269 1475.0347 1477.4050 1493.4578 2972.1026 2974.3820 2980.3926 3062.1093 3065.4827 3074.1867 3088.8886 3092.6035 3100.5894
redmass: 3.5274 5.9113 17.4160 4.6228 1.0502 1.4224 1.2294 2.1785 2.0133 2.9143 2.9638 3.7292 7.6716 7.8282 3.1364 3.2519 1.6296 1.5570 1.2044 1.4596 1.4616 1.9505 2.7260 2.9910 1.1715 1.1804 1.1828 1.0455 1.0498 1.0476 1.0471 1.0469 1.0534 1.0356 1.0357 1.0372 1.0997 1.0986 1.0970 1.0998 1.0993 1.1003
irintensity: 0.2295 0.0902 2.4561 4.6394 0.0056 0.4552 1.4340 2.4643 0.8907 2.8949 14.2844 12.8531 18.1960 51.7624 5.0385 5.9460 2.1152 1.9477 0.0398 2.7393 3.2682 55.4951 2.5953 2.2510 27.9571 30.4052 9.4884 0.6610 2.8095 0.7475 18.7967 25.1771 25.3027 13.4446 27.7154 27.0547 0.0431 37.4151 17.1531 9.2980 12.3793 15.3758
temp: 298.150 k
press: 1.00000 atm
elementType: 17 17 15 6 6 6 6 1 1 1 1 1 1 1 1 1
symmnumber: 1
zpe: 322236.2 jmol-1
zpe.correction: 0.122733 hartree
zpe.thermalcorrener: 0.132981 hartree
zpe.thermalcorrenthalpy: 0.133925 hartree
zpe.thermalcorrgfe: 0.087052 hartree
zpe.sumelectzpe: -1418.630655 hartree
zpe.sumelectthermal: -1418.620407 hartree
zpe.sumelectthermalent: -1418.619463 hartree
zpe.sumelectthermalfe: -1418.666336 hartree
dipole: -3.9621 -0.0148 -0.5226
dipole: 3.9964
quadrupole: -65.5384 -69.0667 -64.7062
quadrupole: 0.0136 -0.1504 0.0079
quadrupole: 0.8987 -2.6296 1.7309 0.0136 -0.1504 0.0079
hfenergy: -1418.7533881 hartree
pointgroup: C01 [X(C4H9Cl2P1)]
dipole: -1.5636031 0.1014313 -0.130432 debye
dipolederiv: -0.4234607 -0.2410923 -0.0638786 -0.2168242 -0.551784 -0.119465 -0.1537767 -0.2872074 -0.3513536 -0.3733251 0.2247796 0.0074088 0.222291 -0.6905313 0.0385929 -0.0677218 0.214481 -0.26144 0.7958413 0.010309 0.0595353 0.0130159 1.1326768 0.0764323 0.0293533 0.0790482 0.535423 0.2213552 -0.0048479 -0.0767986 -0.0011251 -0.0671821 0.0000167 -0.1052778 0.0004315 -0.0278322 -0.1480361 0.1040609 -0.0126662 -0.1109872 -0.0292347 0.028527 0.1015135 -0.0470912 0.0065266 -0.1464225 -0.0835233 -0.0429389 0.0908282 -0.0271396 -0.0357871 0.1375828 0.0238422 0.0074069 -0.1254292 -0.0066863 0.0688983 0.0138325 -0.0304142 0.0018494 -0.0551023 0.0097881 -0.0768172 0.1256351 0.0001153 -0.0018767 -0.0003642 0.0783176 0.0117316 -0.040377 0.061324 -0.1362 -0.1203363 0.0311052 0.0787805 0.0188942 0.066561 0.0211365 0.1029679 -0.0025301 0.0752877 0.0707608 -0.1127399 -0.0557229 -0.0423535 -0.0217987 -0.0512239 -0.0421284 -0.072039 0.0638681 0.0884212 0.1087779 -0.0189243 0.0378414 -0.0690022 0.0191749 -0.024554 0.0395728 0.0915531 0.1249084 -0.0046566 -0.0023687 0.0073581 0.0798753 0.0520408 -0.045562 0.0070728 -0.1379879 -0.1252933 -0.0290633 0.0684341 -0.0237033 0.0803096 -0.0292828 0.0968002 -0.0090023 0.0654873 0.0643764 -0.0837039 -0.0796346 -0.0720206 -0.0091653 -0.0890682 -0.0345549 -0.0258112 0.0555961 -0.1142149 -0.0006098 0.1161584 -0.0001601 0.1150932 0.0068362 0.1133328 0.0078366 0.0087625 0.0852197 0.0877755 -0.0444058 0.063477 -0.0565813 0.0684886 -0.0124955 0.000284 0.0817195 unknown
polarizability: 95.363779|-0.0876181|99.5033699|2.0709055|3.9969205|69.0507225 unknown
InChI: InChI=1S/C4H9P.2Cl/c1-4(2,3)5;;/h1-3H3;;
charge 0 multiplicity 1
16 atoms
Cl 1.985398 1.618707 0.233484
Cl 1.797602 -1.866217 -0.227842
P  0.836952 0.061423 -0.970045
C  -0.809607 0.016045 0.062802
C  -1.483895 1.388769 -0.210543
C  -1.640223 -1.136157 -0.567097
C  -0.597541 -0.208654 1.571751
H  -1.597175 1.59741 -1.291932
H  -2.497144 1.375671 0.232538
H  -0.916361 2.215943 0.249893
H  -1.182458 -2.121849 -0.37267
H  -1.769009 -1.015579 -1.659962
H  -2.648332 -1.129878 -0.111811
H  0.01566 0.593244 2.01788
H  -1.583886 -0.209436 2.074804
H  -0.106782 -1.176639 1.772049
