program: Gaussian 09
title: 000117686
version: EM64L-G09RevD.01
frameworkgroup: C1[X(C12H11NO3S)]
method: RPBEPBE
basis: SDD
operation: Freq
keyword: #p
keyword: freq=noraman
keyword: PBEPBE/SDD
title: #p freq=noraman PBEPBE/SDD
converged: YES YES NO NO
title: Mulliken charges:
elementType: S O O O N C C C C C C C C C C C C H H H H H H H H H H H
charge: 0.867359 -0.546080 -0.542766 -0.425154 -0.690598 -0.102305 -0.089106 -0.216307 -0.215072 -0.208573 -0.207430 -0.393233 -0.392936 0.512498 -0.365538 -0.325736 0.300381 0.273805 0.273152 0.280707 0.278453 0.228477 0.228025 0.230835 0.262454 0.312934 0.312638 0.359116
chargesum: 0.00000
title: Mulliken charges with hydrogens summed into heavy atoms:
elementType: S O O O N C C C C C C C C C C C C
charge: 0.867359 -0.546080 -0.542766 -0.066037 -0.065025 -0.102305 -0.089106 0.057498 0.058079 0.072134 0.071023 -0.164756 -0.164911 0.512498 -0.134703 -0.063282 0.300381
polarizability: 2.30987507e+02 6.56845253e+00 1.29620674e+02 -2.70073633e+00 -6.63118629e-02 1.62987673e+02
1716.lowfreq: -9.1451 -8.0266 -4.3942 -0.0023 -0.0021 -0.0018 22.5251 30.1654 38.4353
frequency: 22.2871 30.1619 38.2251 99.0727 116.6132 145.2055 159.0053 223.4109 226.1831 265.4398 294.0264 316.1867 340.9980 383.2805 395.8157 400.6084 407.7890 412.3682 413.5167 418.2739 423.0527 459.4088 516.4338 522.1633 583.5961 613.0033 620.7182 623.9653 715.8089 721.7139 774.7433 795.5820 808.9041 812.1814 818.1012 835.6664 842.5435 918.0869 944.9357 952.4594 962.1792 967.5544 983.2213 990.1844 1020.3998 1047.6518 1055.0000 1099.5232 1128.5818 1142.4781 1168.7755 1181.2927 1248.1991 1292.6517 1297.1540 1317.8442 1398.6083 1402.3463 1416.7044 1429.7476 1475.2491 1490.0020 1589.5313 1593.0967 1613.5867 1613.9998 1647.0103 3125.0225 3130.6594 3132.6786 3154.9539 3157.8076 3160.1858 3161.4835 3179.7449 3564.1944 3582.3331 3703.5881
redmass: 3.6218 6.8677 4.0314 6.1168 8.1413 5.8521 7.5993 9.7720 9.4948 7.5433 5.7605 7.4093 5.3537 1.1140 2.7949 1.0976 2.2468 2.7858 2.8027 2.2799 4.2859 9.4049 2.8375 2.6813 7.3700 7.5521 7.0650 6.9390 3.5258 2.9884 11.8283 6.1852 4.0071 1.4083 1.2630 1.8136 1.5773 15.4420 1.3530 1.3639 1.3584 1.3568 4.7958 4.6737 1.4297 2.5020 2.5284 1.3569 1.1921 1.3533 1.1184 1.1198 2.6317 1.3144 1.2978 2.6851 6.0357 7.6545 2.8541 3.6398 2.5132 2.9342 7.3713 6.6884 5.6328 5.5068 1.2262 1.0899 1.0889 1.0887 1.0897 1.0948 1.0955 1.0957 1.0966 1.0452 1.0661 1.1040
irintensity: 0.5111 1.6168 0.9487 1.1444 1.8206 1.2155 0.5921 13.0331 2.9672 1.0096 7.2313 7.0718 4.4110 135.7734 6.8915 0.1840 75.1379 4.0402 4.4826 233.0521 4.5404 151.8289 74.6274 51.4351 2.0007 63.3610 0.3424 0.8560 0.8867 1.4028 63.8679 57.4745 42.8458 5.4346 1.3893 55.0634 48.9257 72.2308 0.7380 0.9834 0.0681 0.0900 2.2128 1.3594 0.8665 68.8616 26.1570 40.8258 18.7453 252.7321 37.3044 29.3282 46.5920 6.8849 11.4637 76.4209 6.1977 6.9716 37.2056 2.3255 65.2057 74.0669 10.6165 64.4217 98.1986 65.1821 261.3960 15.0110 13.8024 15.4409 0.8383 1.8360 10.8236 7.4480 6.0677 104.6000 54.1828 24.4066
temp: 298.150 k
press: 1.00000 atm
elementType: 16 8 8 8 7 6 6 6 6 6 6 6 6 6 6 6 6 1 1 1 1 1 1 1 1 1 1 1
symmnumber: 1
zpe: 538539.4 jmol-1
zpe.correction: 0.205119 hartree
zpe.thermalcorrener: 0.221070 hartree
zpe.thermalcorrenthalpy: 0.222014 hartree
zpe.thermalcorrgfe: 0.160417 hartree
zpe.sumelectzpe: -1140.980824 hartree
zpe.sumelectthermal: -1140.964873 hartree
zpe.sumelectthermalent: -1140.963929 hartree
zpe.sumelectthermalfe: -1141.025526 hartree
dipole: -2.5124 -7.7895 -1.6524
dipole: 8.3498
quadrupole: -69.6536 -121.6549 -96.7709
quadrupole: 9.3145 -9.2449 3.5117
quadrupole: 26.3728 -25.6284 -0.7445 9.3145 -9.2449 3.5117
hfenergy: -1141.1859429 hartree
pointgroup: C01 [X(C12H11N1O3S1)]
dipole: 0.9847479 3.075163 -0.6043908 debye
polarizability: 230.8986703|6.8262064|129.6621251|3.3446615|-0.2777577|163.0350586 unknown
InChI: InChI=1S/C12H11NO3S/c13-9-1-5-11(6-2-9)17(15,16)12-7-3-10(14)4-8-12/h1-8,14H,13H2
charge 0 multiplicity 1
28 atoms
S  0.000454 -1.667946 -0.01264
O  -0.006808 -2.43647 -1.463046
O  -0.016657 -2.449884 1.429689
O  -4.92697 1.867304 0.045248
N  4.946093 1.856025 0.026201
C  1.507285 -0.54546 -0.001633
C  -1.51392 -0.535198 -0.016808
C  2.064196 -0.18039 1.236357
C  2.074627 -0.167049 -1.230749
C  -2.08337 -0.196134 -1.253221
C  -2.055906 -0.133675 1.216934
C  3.215747 0.626624 1.244277
C  3.226235 0.639978 -1.220096
C  3.808701 1.05541 0.016907
C  -3.236807 0.617147 -1.257181
C  -3.205998 0.678993 1.210469
C  -3.786301 1.056691 -0.025584
H  1.619495 -0.546892 2.167604
H  1.637597 -0.522969 -2.169675
H  -1.651072 -0.58361 -2.181492
H  -1.604227 -0.474869 2.154006
H  3.668017 0.920978 2.198428
H  3.686863 0.944493 -2.167062
H  -3.706424 0.896978 -2.208529
H  -3.670758 1.019253 2.1398
H  5.375935 2.141866 0.901164
H  5.384101 2.15081 -0.841699
H  -5.279828 2.070494 -0.856468
