program: Gaussian 09
title: 000117661
version: EM64L-G09RevD.01
frameworkgroup: C1[X(C12H11N5O2)]
method: RPBEPBE
basis: SDD
operation: Freq
keyword: #p
keyword: freq=noraman
keyword: PBEPBE/SDD
title: #p freq=noraman PBEPBE/SDD
converged: YES YES NO NO
title: Mulliken charges:
elementType: O O N N N N N C C C C C C C C C C C C H H H H H H H H H H H
charge: -0.225345 -0.226476 -0.122731 -0.143605 -0.660307 -0.687029 0.018154 -0.010557 0.381716 0.589279 -0.592115 -0.232632 -0.440239 0.178548 0.376912 -0.327586 -0.267196 -0.343571 -0.341740 0.218380 0.275951 0.223590 0.256173 0.254449 0.284406 0.280617 0.307743 0.339559 0.320442 0.315209
chargesum: 0.00000
title: Mulliken charges with hydrogens summed into heavy atoms:
elementType: O O N N N N N C C C C C C C C C C C C
charge: -0.225345 -0.226476 -0.122731 -0.143605 -0.013005 -0.051378 0.018154 -0.010557 0.381716 0.589279 -0.373734 0.043319 -0.216649 0.178548 0.376912 -0.071414 -0.012747 -0.059165 -0.061123
polarizability: 6.05344944e+02 2.03215352e+00 1.84145828e+02 1.34579445e+00 -9.51852779e-01 6.70803784e+01
1716.lowfreq: -6.4229 -4.6471 -0.0011 -0.0008 -0.0004 2.9196 8.3062 33.6915 52.6745
frequency: 7.1029 33.6910 52.6692 71.4046 83.7350 154.0465 163.4145 194.7997 205.5177 232.6568 269.2399 315.9575 317.6818 359.1168 386.8008 415.6569 421.7408 431.9685 441.0564 457.6708 473.5605 498.7161 512.3164 516.2230 537.3338 579.3169 625.3684 638.1784 649.8627 654.0736 665.4333 735.9554 738.2512 752.8569 764.6695 808.7044 812.9584 841.7038 842.6202 873.1780 896.4685 943.8976 976.8316 989.6610 992.0327 997.9570 1014.2030 1078.9787 1092.1786 1099.4270 1122.0542 1148.4135 1184.1997 1213.2754 1244.6516 1268.3474 1274.6295 1290.1402 1321.4302 1347.3687 1358.8962 1398.8848 1430.7186 1432.5811 1463.6411 1500.7460 1511.0538 1554.9766 1574.6579 1594.0078 1603.9070 1640.4626 1649.5080 3124.6567 3133.1373 3161.0912 3165.5760 3169.0967 3184.1034 3187.9057 3511.6003 3555.5931 3683.5052 3695.5634
redmass: 4.8256 7.2899 6.4130 7.5641 5.5874 6.9800 7.0621 7.6003 4.1377 7.6150 5.2944 3.2086 6.0535 3.2239 6.9588 2.8993 1.1677 1.1635 4.2371 1.4808 1.9692 5.6833 6.2091 3.3768 6.4975 5.2953 7.1670 2.0653 1.5314 7.3798 4.4962 6.0134 3.1785 2.7757 8.2361 1.6260 6.2713 1.3040 2.0835 1.7245 6.5131 2.5861 1.3328 2.6602 1.3434 1.3609 1.5320 1.3774 3.2639 1.2993 1.7268 1.3415 2.2723 5.2105 2.1683 2.7246 1.5324 1.6523 8.9162 7.5155 3.0200 7.0161 5.7089 5.0353 2.5594 3.7442 3.7618 4.7709 7.1801 1.9397 3.0024 4.5503 1.2647 1.0913 1.0892 1.0892 1.0873 1.0952 1.0960 1.0965 1.0466 1.0453 1.1018 1.1040
irintensity: 0.0189 0.1415 0.0525 0.0010 5.3085 2.0114 2.8658 0.2607 8.1350 1.4660 7.3660 2.3663 2.7979 1.3428 3.9783 2.4703 94.8870 91.6877 20.6586 168.7747 97.8008 4.3335 1.0696 9.0246 10.0660 14.3826 0.2275 12.4007 76.5895 4.9437 43.1300 2.7828 1.8201 0.8520 6.2775 20.3609 32.4104 11.0643 81.6368 74.8603 7.8181 3.8471 0.4299 3.7841 0.7138 0.0718 11.6141 11.9546 65.1565 30.6375 284.2632 149.3099 92.6342 1550.3444 23.8440 113.7835 95.2472 8.4544 925.0481 109.7321 54.4887 37.7404 3.9159 20.2582 6.8759 21.7840 11.4421 132.2451 28.6381 364.0652 135.8373 463.2535 451.9443 31.3024 19.9336 2.5582 2.4422 12.0619 1.9529 0.4045 27.1574 262.5274 57.5968 26.2494
temp: 298.150 k
press: 1.00000 atm
elementType: 8 8 7 7 7 7 7 6 6 6 6 6 6 6 6 6 6 6 6 1 1 1 1 1 1 1 1 1 1 1
symmnumber: 1
zpe: 582098.2 jmol-1
zpe.correction: 0.221710 hartree
zpe.thermalcorrener: 0.238190 hartree
zpe.thermalcorrenthalpy: 0.239134 hartree
zpe.thermalcorrgfe: 0.175309 hartree
zpe.sumelectzpe: -886.646557 hartree
zpe.sumelectthermal: -886.630077 hartree
zpe.sumelectthermalent: -886.629133 hartree
zpe.sumelectthermalfe: -886.692957 hartree
dipole: -13.5008 1.1111 0.0222
dipole: 13.5465
quadrupole: -106.5886 -92.1884 -115.3667
quadrupole: -5.4787 0.4447 0.5860
quadrupole: -1.8741 12.5262 -10.6521 -5.4787 0.4447 0.5860
hfenergy: -886.8682667 hartree
pointgroup: C01 [X(C12H11N5O2)]
dipole: -5.3080834 0.1817724 -0.4425106 debye
polarizability: 605.344987|1.614548|83.3562891|2.0019756|-40.5049955|167.8698736 unknown
InChI: InChI=1S/C12H11N5O2/c13-8-1-6-12(11(14)7-8)16-15-9-2-4-10(5-3-9)17(18)19/h1-7H,13-14H2
charge 0 multiplicity 1
30 atoms
O  6.219599 -0.244583 0.933822
O  5.918648 0.478252 -1.212508
N  -0.977467 0.185341 -0.217709
N  -0.173355 -0.225826 0.754305
N  -2.63251 1.075163 -2.167002
N  -6.550944 -0.187978 0.457226
N  5.462189 0.087279 -0.063866
C  -2.343182 0.064222 0.02426
C  -3.212344 0.54362 -1.037123
C  -5.176677 -0.09589 0.297455
C  -4.618434 0.454129 -0.882344
C  -2.934311 -0.484486 1.205916
C  -4.31376 -0.569303 1.352116
C  1.210954 -0.110816 0.458014
C  4.003016 0.017678 0.117067
C  2.088629 -0.468467 1.523926
C  1.766518 0.308542 -0.791436
C  3.480831 -0.405085 1.363032
C  3.155204 0.373596 -0.962498
H  -5.276584 0.81487 -1.682071
H  -2.255939 -0.836178 1.98908
H  -4.757054 -0.993198 2.260494
H  1.641093 -0.791262 2.468918
H  1.088252 0.572238 -1.60714
H  4.169337 -0.672441 2.168514
H  3.606836 0.690052 -1.906638
H  -3.185223 1.426525 -2.943029
H  -1.612587 1.103551 -2.1949
H  -6.948837 -0.58291 1.305191
H  -7.188498 0.135168 -0.265772
