program: Gaussian 09
title: 000117091
version: EM64L-G09RevD.01
frameworkgroup: C1[X(C17H14N2O2)]
method: RPBEPBE
basis: SDD
operation: Freq
keyword: #p
keyword: freq=noraman
keyword: PBEPBE/SDD
title: #p freq=noraman PBEPBE/SDD
converged: YES YES NO NO
title: Mulliken charges:
elementType: O O N N C C C C C C C C C C C C C C C C C H H H H H H H H H H H H H H
charge: -0.429134 -0.268415 -0.475623 -0.691985 0.254393 0.294911 0.307033 0.320234 -0.560962 -0.375697 -0.346052 -0.487502 0.272268 -0.408685 0.122364 0.245852 -0.349673 -0.365534 -0.223919 -0.239718 -0.229826 0.191162 0.301329 0.199235 0.217896 0.306141 0.254818 0.314099 0.310335 0.274536 0.219986 0.232138 0.228713 0.353022 0.232260
chargesum: 0.00000
title: Mulliken charges with hydrogens summed into heavy atoms:
elementType: O O N N C C C C C C C C C C C C C C C C C
charge: -0.076112 -0.268415 -0.169483 -0.067551 0.254393 0.294911 0.307033 0.320234 -0.369800 -0.074367 -0.146817 -0.269606 0.272268 -0.153867 0.122364 0.245852 -0.075137 -0.145548 0.008219 -0.011005 0.002434
polarizability: 3.66723684e+02 1.32927385e+01 2.46378287e+02 -1.21660835e+01 9.99944668e+00 9.65330515e+01
1716.lowfreq: -6.4943 -0.0007 -0.0005 0.0006 1.0602 6.1656 16.7428 34.5753 49.5347
frequency: 16.6534 34.5266 49.5249 69.9755 84.8698 111.1121 150.2624 154.1321 203.2803 232.4627 268.0935 277.6127 295.8659 312.5357 359.8139 367.1663 374.8726 387.9661 403.7916 415.0881 420.5438 448.0416 461.8455 501.1053 515.2462 523.1703 565.2733 599.2757 614.4506 623.8116 656.5679 664.4442 681.6803 692.0563 703.0911 720.0678 749.5996 769.3571 788.8566 808.2973 817.4041 830.4901 853.3199 871.7666 915.5234 931.6728 940.1364 955.7447 981.4945 988.5289 989.1391 1003.9081 1019.1354 1034.9422 1083.4596 1102.1770 1113.0557 1132.5091 1161.0931 1173.1131 1187.7409 1191.0197 1233.6267 1256.3094 1274.3469 1290.3085 1317.3079 1325.0656 1377.3305 1382.9878 1387.0411 1412.3965 1431.9354 1456.2122 1470.0133 1479.6301 1501.3888 1556.5544 1572.0671 1592.0072 1604.5123 1608.3209 1613.9311 1629.7504 1647.4709 3099.4075 3109.5183 3130.1833 3130.6026 3133.1540 3143.0839 3157.3684 3169.0796 3177.2594 3193.3097 3551.9679 3577.2853 3577.9642 3715.6843
redmass: 5.0651 4.9139 5.4030 5.6332 3.3629 3.7006 5.3273 5.0822 6.4763 5.4556 1.3102 4.7700 3.9998 6.0562 3.5266 1.1889 2.0443 2.2030 2.8390 2.7258 3.2721 5.8707 4.9933 4.9255 3.4292 3.5811 5.5910 1.6704 5.9756 2.1462 4.0483 6.2701 5.3837 5.6855 1.5623 6.5064 1.9166 4.9558 2.4412 1.8335 2.4396 1.5036 1.2976 5.1448 5.1139 1.4838 1.3737 1.3617 1.4622 2.9634 2.5068 1.3426 3.1320 2.4735 1.6053 2.5701 1.9366 1.6400 1.3770 1.0584 1.3193 1.1231 2.1687 2.0358 2.1470 1.9371 1.3883 2.5256 3.6780 6.5091 3.6648 5.5124 2.2900 3.0974 3.0741 2.4238 2.4329 3.7663 6.3901 5.9561 5.1945 6.0027 5.4203 6.0232 1.2375 1.0893 1.0878 1.0901 1.0866 1.0880 1.0919 1.0955 1.1004 1.0959 1.0937 1.0748 1.0462 1.0651 1.1029
irintensity: 2.5382 0.7079 1.4029 1.9807 9.2126 3.5826 1.9989 1.4376 1.6638 1.2682 75.1037 14.9288 0.3095 7.2208 14.5789 155.4529 45.0858 129.5926 0.0594 0.1773 9.0982 9.5562 7.2746 4.8620 3.0226 8.8148 17.9522 34.6275 0.6861 28.4807 12.3142 5.4125 15.9482 9.1895 84.0541 2.4743 1.7319 5.6643 18.2525 63.7053 22.7559 59.4615 0.8534 12.1778 21.9721 4.9155 0.1802 2.2477 1.9427 7.4042 9.9704 1.7970 6.9691 1.4123 21.7572 10.6470 8.8305 275.5546 23.1906 0.8970 11.3380 7.7546 10.8337 78.9090 17.2683 36.4837 11.1584 29.9093 56.0078 7.2662 25.0643 11.7773 6.1795 28.2538 58.2902 54.1109 614.3593 1.9045 100.3269 23.6246 82.4398 19.7936 63.3562 124.4018 303.3502 24.6267 15.5260 18.0944 0.5076 28.5835 22.9101 17.6845 25.3643 9.6782 3.0789 14.9413 116.3435 25.0315 20.2688
temp: 298.150 k
press: 1.00000 atm
elementType: 8 8 7 7 6 6 6 6 6 6 6 6 6 6 6 6 6 6 6 6 6 1 1 1 1 1 1 1 1 1 1 1 1 1 1
symmnumber: 1
zpe: 709625.7 jmol-1
zpe.correction: 0.270282 hartree
zpe.thermalcorrener: 0.288181 hartree
zpe.thermalcorrenthalpy: 0.289125 hartree
zpe.thermalcorrgfe: 0.223177 hartree
zpe.sumelectzpe: -914.737673 hartree
zpe.sumelectthermal: -914.719774 hartree
zpe.sumelectthermalent: -914.718829 hartree
zpe.sumelectthermalfe: -914.784778 hartree
dipole: -1.5104 2.2937 0.7607
dipole: 2.8497
quadrupole: -89.3409 -118.5386 -127.7800
quadrupole: 23.0420 -1.9972 0.4733
quadrupole: 22.5456 -6.6521 -15.8935 23.0420 -1.9972 0.4733
hfenergy: -915.0079547 hartree
pointgroup: C01 [X(C17H14N2O2)]
dipole: -0.6090938 -0.8792208 -0.3361666 debye
polarizability: 366.1567546|-15.9146689|245.8649143|12.4280047|15.6906666|97.6133541 unknown
InChI: InChI=1S/C17H14N2O2/c18-15-8-9-16(14-10-12(20)6-7-13(14)15)19-17(21)11-4-2-1-3-5-11/h1-10,19-20H,18H2
charge 0 multiplicity 1
35 atoms
O  -2.303538 -3.883396 0.240743
O  1.912512 2.306199 0.521997
N  0.71982 0.356267 -0.038381
N  -4.677745 2.174959 -0.180277
C  -1.693468 -0.159402 0.016924
C  -3.072134 0.288782 -0.066028
C  -0.628392 0.818089 -0.015411
C  -3.364678 1.70751 -0.114707
C  -1.443372 -1.570159 0.129718
C  -0.947278 2.186866 -0.051665
C  -4.110801 -0.698925 -0.082812
C  -2.292804 2.621936 -0.090694
C  -2.492152 -2.495422 0.121554
C  -3.844853 -2.06335 -0.000684
C  1.890969 1.080424 0.17999
C  3.163674 0.288254 0.00324
C  4.314517 0.741859 0.698071
C  3.271755 -0.849049 -0.842322
C  5.540029 0.055267 0.578591
C  4.501414 -1.533306 -0.965535
C  5.63672 -1.088776 -0.249343
H  -0.422129 -1.94758 0.275105
H  -0.136522 2.916989 -0.036093
H  -5.15987 -0.39442 -0.16717
H  -2.499806 3.698345 -0.110283
H  0.849936 -0.635806 -0.236769
H  -4.640615 -2.81269 -0.014007
H  -4.853374 3.174586 -0.219742
H  -5.478395 1.554687 -0.139634
H  4.220722 1.639576 1.317685
H  2.420881 -1.180634 -1.451676
H  6.419672 0.411114 1.126071
H  4.577748 -2.400873 -1.630381
H  -1.344106 -4.106124 0.335918
H  6.589963 -1.620095 -0.346392
