program: Gaussian 09
title: 000117073
version: EM64L-G09RevD.01
frameworkgroup: C1[X(C20H25N4O2S)]
method: RPBEPBE
basis: SDD
operation: Freq
keyword: #p
keyword: freq=noraman
keyword: PBEPBE/SDD
title: #p freq=noraman PBEPBE/SDD
converged: YES YES NO NO
title: Mulliken charges:
elementType: S O O N N N N C C C C C C C C C C C C C C C C C C C C H H H H H H H H H H H H H H H H H H H H H H H H H
charge: 0.361862 -0.456433 -0.241955 -0.121934 -0.148225 -0.070442 -0.069704 -0.092526 -0.426765 0.437249 -0.318114 -0.702556 -0.650505 -0.306763 -0.268494 0.630580 -0.294088 -0.369481 0.145456 -0.392776 -0.180597 -0.287841 -0.391647 -0.637387 0.340488 -0.340523 -0.534720 0.257184 0.237765 0.294531 0.211063 0.216746 0.246120 0.223033 0.241804 0.244139 0.227017 0.229774 0.252858 0.237257 0.273203 0.268495 0.368583 0.266646 0.273921 0.260719 0.285487 0.260362 0.276844 0.267660 0.233285 0.233348
chargesum: 1.00000
title: Mulliken charges with hydrogens summed into heavy atoms:
elementType: S O O N N N N C C C C C C C C C C C C C C C C C C C C
charge: 0.361862 -0.087850 -0.241955 -0.121934 -0.148225 -0.070442 -0.069704 0.164658 0.105531 0.437249 0.109695 0.008402 0.050425 -0.053904 -0.031237 0.630580 -0.020885 -0.100986 0.145456 -0.392776 -0.180597 -0.021195 -0.117727 0.169180 0.340488 -0.063679 0.199573
polarizability: 1.00490139e+03 1.95633041e+00 2.60655332e+02 -9.42873830e+00 7.03649937e+00 1.44033327e+02
1716.lowfreq: -8.7398 -2.2447 -0.0016 -0.0013 -0.0008 3.6294 15.5538 21.4174 30.6727
frequency: 14.6802 21.2939 30.6664 44.1666 60.1836 68.2557 78.7614 85.4079 95.0271 118.4320 124.1069 134.4608 141.3049 144.6714 154.7740 178.4653 183.8324 197.3008 216.7995 221.4221 233.2694 235.0249 256.6923 265.2466 291.3239 299.3677 308.1199 345.7412 356.3917 373.4692 392.4243 403.9839 410.5032 436.9161 443.5996 451.0029 471.9049 491.7951 497.0124 499.8405 509.9643 556.4047 574.6321 579.8739 591.5500 607.1070 621.1066 634.5088 680.0609 715.8765 723.7359 751.0853 783.0401 792.8217 797.9306 818.2872 841.3188 845.1807 846.0893 864.4742 872.7213 897.8263 936.6397 940.0009 958.1523 973.6607 977.1335 979.3725 987.6137 988.6743 1008.6887 1027.1744 1056.6216 1081.8992 1096.4100 1110.9134 1111.6948 1122.6434 1122.9483 1126.2670 1138.5902 1140.3471 1155.7190 1157.4770 1171.1450 1191.1875 1213.3242 1225.9580 1230.1332 1266.4214 1272.8123 1298.9653 1309.2272 1312.7857 1324.0133 1334.6291 1347.0096 1353.9479 1372.6385 1391.5638 1394.0728 1397.5683 1412.1355 1415.7559 1433.5751 1439.7401 1440.8468 1465.0944 1467.2958 1468.9232 1470.1790 1471.9073 1477.6498 1478.4899 1479.2749 1481.6464 1484.3647 1488.5640 1507.9343 1518.2458 1525.4815 1544.2599 1576.3787 1612.7786 1628.1662 2964.8733 2976.1441 2990.4778 3006.7121 3009.6188 3017.4100 3038.2007 3039.8693 3072.4044 3077.7599 3094.2717 3097.0223 3101.9959 3103.5283 3115.9125 3147.3664 3151.2390 3162.4214 3165.0259 3165.6283 3178.2882 3186.8842 3187.2634 3213.6015 3588.8996
redmass: 4.7313 4.8416 5.6523 6.6509 4.2642 3.1303 3.3476 3.6730 3.0782 3.4785 3.9463 3.4544 2.5304 1.7171 1.1951 3.3921 2.7145 3.7026 1.0961 2.3369 2.1762 2.6734 3.1687 3.0184 1.4804 2.5768 3.3210 3.4240 4.2756 6.4163 3.5837 5.1328 5.6738 3.2622 4.6736 3.8347 3.8570 6.1834 3.2934 5.5408 4.8859 3.6281 4.8382 3.5579 3.9220 4.5513 6.6658 5.3607 6.3331 6.0973 4.0731 4.6337 4.9446 1.2065 1.2695 1.4077 2.4004 3.2690 1.5583 2.1442 4.8799 2.3652 1.6525 1.8343 1.3395 2.8788 1.3608 6.0488 2.2343 1.9073 7.1753 3.0557 3.2423 2.0307 1.8917 1.8204 1.2578 1.3965 1.8203 1.7203 1.6672 1.5532 1.9170 1.5792 1.6281 1.2882 1.1953 1.6914 2.0251 1.3042 1.9404 2.1594 1.2608 1.7177 3.9043 1.4629 2.7195 1.7593 3.2415 3.8730 1.3140 1.2750 1.2713 1.6053 1.4415 1.7052 2.0709 1.3532 1.1258 1.0488 1.0733 1.0496 1.1431 2.1144 1.0806 1.0437 1.0955 3.2082 2.2102 3.4294 1.9365 2.3821 7.8761 6.5546 6.5026 1.0558 1.0327 1.0360 1.0377 1.0346 1.0999 1.0774 1.0755 1.1050 1.1009 1.0993 1.0992 1.1032 1.1037 1.0990 1.1004 1.1003 1.0913 1.0875 1.0894 1.0923 1.0961 1.0973 1.0929 1.0669
irintensity: 0.1608 0.4616 0.2032 1.0122 0.7171 0.4168 5.0469 6.3109 6.2376 7.8419 3.1270 1.2964 3.2807 6.4460 0.0563 0.3939 1.7937 6.2454 0.0417 4.4473 1.6309 3.9572 1.6321 9.6203 147.6939 49.6389 11.6639 0.5012 6.4748 19.9181 11.6340 6.9099 1.4805 9.4260 0.6731 5.8285 15.9033 49.8741 26.0896 7.8663 1.3584 1.3869 0.5267 8.6267 6.1873 3.6511 5.2537 3.6029 1.3170 60.6801 2.0063 1.8088 108.0732 1.8303 4.2755 34.1435 69.3550 53.2323 42.6309 6.2498 3.5601 0.5712 1.4795 44.3738 0.0684 2.8431 0.9895 91.4383 38.6321 22.4988 7.6895 6.3710 4.9234 78.1059 88.4343 20.7338 0.0305 1.6656 8.2374 59.9588 19.1138 34.8537 15.2457 55.8413 53.4073 624.3676 103.7755 22.6740 130.5269 260.3314 276.0530 266.5596 14.9960 42.6610 665.4884 206.7412 634.6668 11.0412 494.6959 26.1082 7.0694 19.8088 14.7692 13.7141 70.0563 102.4481 1.2408 17.3194 63.1364 14.2945 4.5555 19.0088 7.4901 43.5122 7.7956 20.5504 15.0882 38.2158 18.8891 20.3454 59.9172 118.5215 3.2386 973.9461 338.5459 40.3659 61.7673 23.8918 14.7902 26.4097 28.8718 31.5003 37.7502 32.8866 17.3460 35.2193 35.0559 7.7152 11.2421 22.8430 16.7493 1.8598 0.4515 0.2019 1.5117 3.8217 12.0168 1.3292 14.0492 17.4306
temp: 298.150 k
press: 1.00000 atm
elementType: 16 8 8 7 7 7 7 6 6 6 6 6 6 6 6 6 6 6 6 6 6 6 6 6 6 6 6 1 1 1 1 1 1 1 1 1 1 1 1 1 1 1 1 1 1 1 1 1 1 1 1 1
symmnumber: 1
zpe: 1103141.1 jmol-1
zpe.correction: 0.420164 hartree
zpe.thermalcorrener: 0.447662 hartree
zpe.thermalcorrenthalpy: 0.448606 hartree
zpe.thermalcorrgfe: 0.360715 hartree
zpe.sumelectzpe: -1542.389392 hartree
zpe.sumelectthermal: -1542.361895 hartree
zpe.sumelectthermalent: -1542.360950 hartree
zpe.sumelectthermalfe: -1542.448841 hartree
dipole: 2.7968 -0.0991 0.2146
dipole: 2.8068
quadrupole: 9.0492 -122.8739 -163.5548
quadrupole: -4.3518 1.1442 -1.0799
quadrupole: 101.5090 -30.4140 -71.0950 -4.3518 1.1442 -1.0799
hfenergy: -1542.8095565 hartree
pointgroup: C01 [X(C20H25N4O2S1)]
dipole: 1.099715 0.0525936 0.0853648 debye
polarizability: 1004.9816308|0.681959|193.8726628|-4.5854316|-58.1844096|210.7357511 unknown
InChI: InChI=1S/C20H25N4O2S/c1-5-24(14(2)13-25)16-8-6-15(7-9-16)21-22-20-23(3)18-11-10-17(26-4)12-19(18)27-20/h6-12,14,25H,5,13H2,1-4H3
charge 1 multiplicity 1
52 atoms
S  -2.844495 -0.772327 0.939814
O  7.217287 1.031442 2.064791
O  -8.199421 -0.541445 0.699282
N  5.570234 0.161653 -0.115805
N  -3.10575 1.005227 -1.033098
N  -0.03238 -0.182382 0.284746
N  -0.816507 0.551113 -0.540067
C  6.537805 -0.742249 0.600343
C  6.23151 1.226611 -0.932659
C  4.202759 0.073415 -0.032527
C  6.710839 -0.344814 2.082253
C  6.297423 -2.254736 0.390142
C  6.586818 0.759668 -2.35996
C  3.359723 0.848907 -0.929779
C  3.532209 -0.76796 0.937051
C  -4.432499 0.683912 -0.67023
C  1.978202 0.790773 -0.860814
C  2.148284 -0.818158 1.006026
C  1.3237 -0.045061 0.115875
C  -4.502941 -0.266458 0.383286
C  -2.134327 0.355321 -0.315641
C  -5.618894 1.205794 -1.242206
C  -5.729683 -0.722151 0.891766
C  -2.792615 1.972386 -2.107776
C  -6.914328 -0.194977 0.312492
C  -6.849952 0.762352 -0.74608
C  -8.369175 -1.523933 1.782865
H  7.5103 -0.514498 0.12776
H  5.584102 2.118119 -0.954487
H  7.137718 1.521532 -0.378179
H  5.755517 -0.410729 2.639955
H  7.44172 -1.041207 2.543295
H  6.084866 -2.465981 -0.671822
H  5.476342 -2.675939 0.990667
H  7.218356 -2.799902 0.662475
H  7.098638 1.575817 -2.899813
H  7.269423 -0.108709 -2.342514
H  5.688365 0.474987 -2.935398
H  3.81833 1.471997 -1.700548
H  4.109892 -1.351311 1.652456
H  1.361264 1.368591 -1.554978
H  1.646612 -1.441134 1.753173
H  7.384759 1.353056 2.984789
H  -5.585903 1.938397 -2.053154
H  -5.764293 -1.454376 1.701779
H  -3.210633 2.960852 -1.852762
H  -1.70107 2.045221 -2.199661
H  -3.223615 1.62239 -3.060922
H  -7.79204 1.136319 -1.155506
H  -9.456075 -1.628449 1.900778
H  -7.923231 -1.153308 2.724731
H  -7.926268 -2.498355 1.504098
