program: Gaussian 09
title: 000014398
version: EM64L-G09RevD.01
frameworkgroup: C1[X(C15H9I3O4)]
method: RPBEPBE
basis: SDD
operation: Freq
keyword: #p
keyword: freq=noraman
keyword: PBEPBE/SDD
title: #p freq=noraman PBEPBE/SDD
converged: YES YES NO NO
title: Mulliken charges:
elementType: I I I O O O O C C C C C C C C C C C C C C C H H H H H H H H H
charge: 0.151220 0.176949 0.172843 -0.271720 -0.204636 -0.436872 -0.234676 0.353566 0.539854 0.371753 -0.219627 -0.396432 -0.466526 -0.296662 -0.460763 -0.459238 0.262291 -0.307793 -0.269059 0.130848 -0.795614 0.123904 0.284607 0.264651 0.255580 0.295782 0.298165 0.238412 0.238515 0.266525 0.394156
chargesum: 0.00000
title: Mulliken charges with hydrogens summed into heavy atoms:
elementType: I I I O O O O C C C C C C C C C C C C C C C
charge: 0.151220 0.176949 0.172843 -0.271720 -0.204636 -0.042717 -0.234676 0.353566 0.539854 0.371753 0.064980 -0.131781 -0.466526 -0.041082 -0.460763 -0.459238 0.262291 -0.012011 0.029105 0.130848 -0.052162 0.123904
polarizability: 3.08027510e+02 -2.38370430e+00 2.33528769e+02 -5.01551033e+01 2.75997388e+00 2.34931878e+02
1716.lowfreq: -5.5265 -4.8386 -2.1243 -0.0005 0.0001 0.0002 7.9546 10.8694 17.7893
frequency: 7.8531 10.6725 17.6062 20.0430 40.3040 56.7022 72.0055 86.8629 104.2047 108.0587 144.3096 144.7955 154.3063 177.4822 196.8200 202.8899 214.9746 248.6118 259.8224 270.3137 284.2239 318.5180 369.4697 419.8448 439.7681 459.7257 487.4304 493.6555 511.7796 529.1583 547.1880 563.3340 589.5461 600.4271 614.2413 642.6078 658.8888 690.0084 723.9653 725.4996 735.8133 761.1515 823.8581 824.1973 877.4540 878.4502 923.8450 932.1456 947.1593 961.1714 1007.7787 1018.2808 1023.2505 1044.8161 1080.9771 1144.6426 1148.3643 1180.2741 1193.7704 1220.6322 1251.4648 1271.9664 1316.1377 1349.9763 1352.6783 1369.2611 1371.9114 1393.7090 1418.5978 1451.2997 1460.3207 1470.3311 1537.6826 1558.9887 1574.0020 1588.2450 1612.4010 1645.3022 2986.5233 3072.9176 3126.2877 3163.9565 3165.5277 3174.0297 3184.8675 3191.4500 3534.8798
redmass: 23.6688 23.3841 4.1777 11.6836 42.4266 11.5748 4.9861 21.1824 12.1173 8.7093 4.9041 7.6075 11.5012 4.7140 1.0651 15.4448 9.5096 8.4968 9.2109 9.3721 6.8190 5.2084 8.1975 5.3390 3.0201 9.4695 3.8429 5.0458 4.7590 4.6488 6.1537 3.3339 4.0240 2.6997 1.5640 6.5866 4.8628 9.7890 3.6262 7.1825 5.3781 6.9729 1.5674 5.1934 7.8223 1.4737 1.4151 1.4829 2.3618 1.3495 3.3031 5.6306 1.8007 3.0597 2.3961 1.3906 1.6716 2.8973 1.6076 3.8402 3.6521 1.4617 2.5882 5.8796 3.6157 3.8185 1.2753 4.8081 4.2282 1.2547 2.0516 1.0499 9.7042 6.7105 6.7046 7.1028 8.2065 9.2506 1.0378 1.0976 1.0988 1.0917 1.0879 1.0930 1.0970 1.0933 1.0643
irintensity: 0.7116 0.7589 3.8667 0.2791 0.1122 1.4273 0.4933 0.0240 0.5870 0.2212 0.8311 3.5657 0.2239 0.0315 0.3766 0.1026 0.9556 5.2047 0.8095 1.1844 1.4649 0.8969 2.3075 5.4490 4.1293 13.9263 4.3747 0.8119 33.2496 2.3078 9.8765 33.3638 90.4935 3.2866 82.8549 3.5236 12.4561 76.4925 0.7067 31.4614 1.9331 23.6577 31.8940 23.3699 50.3517 17.7251 8.1791 18.4924 75.8489 0.0330 28.4961 216.4813 2.3407 119.0500 0.3536 23.0447 131.8651 86.1333 9.8846 469.1321 213.0517 53.2397 256.1034 6.7557 33.0445 72.7202 74.8413 16.2306 100.0460 63.9951 27.0128 20.4425 88.6601 86.4219 126.0842 272.4178 51.5073 259.6207 3.9671 11.5629 13.8701 5.2220 2.4716 3.6762 3.9411 3.3477 66.5193
temp: 298.150 k
press: 1.00000 atm
elementType: 53 53 53 8 8 8 8 6 6 6 6 6 6 6 6 6 6 6 6 6 6 6 1 1 1 1 1 1 1 1 1
symmnumber: 1
zpe: 523549.7 jmol-1
zpe.correction: 0.199410 hartree
zpe.thermalcorrener: 0.221516 hartree
zpe.thermalcorrenthalpy: 0.222460 hartree
zpe.thermalcorrgfe: 0.139648 hartree
zpe.sumelectzpe: -910.849990 hartree
zpe.sumelectthermal: -910.827884 hartree
zpe.sumelectthermalent: -910.826940 hartree
zpe.sumelectthermalfe: -910.909752 hartree
dipole: -2.0972 -1.3907 -2.7080
dipole: 3.6967
quadrupole: -172.9254 -167.3491 -160.3623
quadrupole: 9.2982 -24.5154 -4.7298
quadrupole: -6.0465 -0.4702 6.5166 9.2982 -24.5154 -4.7298
hfenergy: -911.0493998 hartree
pointgroup: C01 [X(C15H9I3O4)]
dipole: 0.5248545 -1.2817506 -0.4437574 debye
polarizability: 328.464858|24.1360567|214.65896|4.5700347|4.115351|233.364338 unknown
InChI: InChI=1S/C15H9I3O4/c1-7(19)10-3-2-9(6-11(10)16)22-14-12(17)4-8(15(20)21)5-13(14)18/h2-6,20H,1H3
charge 0 multiplicity 1
31 atoms
I  -2.404342 3.267821 -0.350263
I  0.839771 -0.948249 3.078804
I  1.133529 -1.307852 -3.067158
O  0.054181 -1.624795 -0.013644
O  -5.28784 2.186362 -0.501367
O  5.778759 1.039092 -1.11895
O  5.770468 1.224734 1.198413
C  -1.167712 -0.916118 -0.108584
C  1.279467 -0.935689 0.007644
C  -3.709568 0.352304 -0.30991
C  -1.241669 0.490573 -0.169307
C  -2.331612 -1.711305 -0.14238
C  -2.503846 1.116232 -0.269706
C  -3.572494 -1.069428 -0.24129
C  1.873427 -0.570196 1.245714
C  1.992697 -0.714271 -1.20078
C  3.844201 0.247366 0.06144
C  3.148795 0.022043 1.275142
C  3.27018 -0.12331 -1.179382
C  -5.091509 0.941017 -0.420883
C  -6.291607 -0.009617 -0.437929
C  5.194492 0.87404 0.142605
H  -0.330575 1.09403 -0.138286
H  -2.243665 -2.799623 -0.094188
H  -4.473199 -1.687613 -0.269044
H  3.623323 0.311663 2.216665
H  3.827696 0.050302 -2.101878
H  -6.342083 -0.621951 0.481242
H  -6.254317 -0.698055 -1.302433
H  -7.205052 0.599421 -0.509824
H  6.673803 1.459574 -1.013286
