program: Gaussian 09
title: 000117065
version: EM64L-G09RevD.01
frameworkgroup: C1[X(C15H16NOS)]
method: RPBEPBE
basis: SDD
operation: Freq
keyword: #p
keyword: freq=noraman
keyword: PBEPBE/SDD
title: #p freq=noraman PBEPBE/SDD
converged: YES YES NO NO
title: Mulliken charges:
elementType: S O N C C C C C C C C C C C C C C C H H H H H H H H H H H H H H H H
charge: 0.402241 -0.414131 -0.141306 0.750048 -0.419651 -0.488696 -0.021056 -0.367616 -0.537548 0.427047 0.391439 -0.480789 -0.715866 -0.319869 -0.401478 -0.396033 -0.221521 -0.217753 0.256050 0.256102 0.235772 0.234375 0.265993 0.275503 0.280572 0.279799 0.276231 0.201954 0.222806 0.255033 0.262821 0.257244 0.258853 0.353430
chargesum: 1.00000
title: Mulliken charges with hydrogens summed into heavy atoms:
elementType: S O N C C C C C C C C C C C C C C C
charge: 0.402241 -0.060701 -0.141306 0.750048 0.092501 -0.488696 -0.021056 0.102531 -0.271555 0.427047 0.391439 -0.205286 0.120736 0.104891 -0.146445 -0.133212 0.035723 0.041099
polarizability: 2.95061153e+02 -3.83563352e+01 2.18233045e+02 -1.46238760e+01 -1.48946758e+01 9.79264767e+01
1716.lowfreq: -6.7515 -3.1799 -0.0019 -0.0017 -0.0012 5.0123 30.0206 47.3456 70.8824
frequency: 29.9922 47.3378 70.8473 81.9867 106.6210 111.8660 130.7086 155.4118 182.2598 217.4217 252.2312 262.2968 278.5459 308.7051 324.4509 344.2671 352.4043 408.3585 434.1658 439.9088 475.1648 518.3563 528.2605 563.4206 582.1380 602.8215 626.6944 663.7518 705.7930 731.6475 765.2811 766.2445 779.8303 782.1532 857.5895 866.8483 883.2865 896.0885 921.0742 939.3534 980.5947 981.2122 1006.5915 1010.3109 1017.1894 1023.8727 1026.8721 1038.5478 1072.1845 1084.3642 1138.7008 1156.6057 1184.7700 1193.0474 1222.4571 1239.5531 1261.7144 1272.9915 1276.5578 1291.7700 1307.2335 1334.8318 1340.7764 1363.4139 1390.4601 1403.6572 1418.0893 1429.0624 1435.2792 1446.7364 1455.2885 1457.6691 1471.4091 1479.9578 1489.8664 1509.3968 1519.9037 1587.2330 1602.8726 1625.4589 2966.8875 2987.7147 3002.8931 3035.4165 3050.8335 3068.6024 3071.0833 3098.0096 3118.6600 3138.2621 3144.3435 3153.1354 3160.1792 3162.1216 3178.8025 3578.7623
redmass: 5.8849 4.9040 1.9603 3.2177 4.3301 2.5154 1.1778 4.1315 3.5938 4.1943 4.1427 1.1521 5.3897 2.8174 4.7332 4.5939 5.3584 3.3526 4.2723 4.3143 2.5975 4.4880 5.4672 6.1532 5.1067 6.7109 5.7547 5.5230 5.4888 3.5213 1.5946 1.3385 2.4327 1.9114 1.3058 1.4187 3.3892 1.4861 1.8726 4.2090 1.3882 4.5578 2.8574 1.3674 1.6398 2.2872 2.8590 4.2717 1.8662 1.6655 1.7273 1.5865 1.1177 1.9651 1.6054 2.0507 1.3789 1.4881 1.9546 1.1114 2.2500 1.5131 1.5246 1.3565 1.2141 1.1701 3.5649 5.8987 2.6116 2.8123 1.1239 1.0918 1.0780 1.2509 1.5106 2.4948 2.3963 8.1835 6.7490 6.2949 1.0660 1.0402 1.0604 1.0616 1.0964 1.0974 1.1031 1.1052 1.0977 1.0888 1.0898 1.0924 1.0937 1.0949 1.1004 1.0671
irintensity: 2.3548 1.9709 5.1511 8.7604 2.3278 2.4372 0.4743 0.4786 1.6822 4.3799 5.6662 178.3484 1.6522 2.0159 0.2756 1.6381 0.4038 2.1503 3.1569 6.6870 24.5291 1.6828 1.0702 0.6296 7.9897 3.7414 6.7601 0.9653 1.6549 8.9452 7.8031 42.8200 1.4868 2.4285 1.8315 3.8862 2.0040 70.3056 0.4733 12.4797 7.2313 78.7244 11.3108 0.0163 2.1455 0.1910 29.8607 30.0131 9.9671 10.1615 8.1361 17.9518 0.7154 15.0491 37.3904 4.9702 25.4895 3.1189 5.6647 1.8327 22.7397 10.2894 6.7884 4.4532 15.8090 26.6664 27.1883 5.5349 7.7046 5.0093 26.1515 21.6018 3.5873 11.6335 20.1569 9.3825 27.2704 17.2141 9.3780 8.8691 45.2006 1.7745 10.7356 12.8652 6.2689 2.0922 18.0497 14.8863 0.1937 2.0381 0.3470 2.2836 0.8475 8.4539 10.5613 25.3855
temp: 298.150 k
press: 1.00000 atm
elementType: 16 8 7 6 6 6 6 6 6 6 6 6 6 6 6 6 6 6 1 1 1 1 1 1 1 1 1 1 1 1 1 1 1 1
symmnumber: 1
zpe: 720509.6 jmol-1
zpe.correction: 0.274428 hartree
zpe.thermalcorrener: 0.291138 hartree
zpe.thermalcorrenthalpy: 0.292082 hartree
zpe.thermalcorrgfe: 0.229268 hartree
zpe.sumelectzpe: -1107.716691 hartree
zpe.sumelectthermal: -1107.699981 hartree
zpe.sumelectthermalent: -1107.699036 hartree
zpe.sumelectthermalfe: -1107.761850 hartree
dipole: -0.9260 1.3588 1.6374
dipole: 2.3205
quadrupole: -70.1479 -78.9669 -111.7162
quadrupole: -12.8048 -10.9259 -3.6404
quadrupole: 16.7958 7.9768 -24.7725 -12.8048 -10.9259 -3.6404
hfenergy: -1107.9911184 hartree
pointgroup: C01 [X(C15H16N1O1S1)]
dipole: 0.372742 0.538339 -0.6362133 debye
polarizability: 296.1033416|37.5015022|216.8375395|-13.4475922|16.7503711|98.2797938 unknown
InChI: InChI=1S/C15H16NOS/c1-11-16(7-4-8-17)14-9-12-5-2-3-6-13(12)10-15(14)18-11/h2-3,5-6,9-10,17H,4,7-8H2,1H3
charge 1 multiplicity 1
34 atoms
S  0.71966 3.05493 0.39716
O  4.658266 -2.919162 1.083379
N  1.626324 0.738337 -0.432396
C  0.229897 0.497909 -0.246913
C  2.560936 -0.351565 -0.849038
C  -0.455293 1.673443 0.208521
C  2.039998 1.993134 -0.144651
C  3.028968 -1.205356 0.352138
C  -0.464824 -0.692974 -0.468432
C  -1.873197 -0.724625 -0.234553
C  -2.562222 0.474275 0.230889
C  -1.823064 1.681213 0.449227
C  3.44443 2.487695 -0.263257
C  4.041905 -2.293419 -0.082859
C  -2.634972 -1.922987 -0.449942
C  -3.977073 0.420461 0.460391
C  -4.009073 -1.940053 -0.217743
C  -4.684787 -0.760852 0.240957
H  2.03711 -0.96211 -1.604974
H  3.426168 0.111917 -1.351524
H  2.160981 -1.672728 0.854825
H  3.532228 -0.565642 1.101058
H  0.040077 -1.59961 -0.816347
H  -2.342544 2.579854 0.795868
H  3.769494 2.518549 -1.321063
H  3.535882 3.507735 0.140021
H  4.150617 1.84168 0.289272
H  3.561489 -3.038882 -0.751658
H  4.884239 -1.834146 -0.630108
H  -2.123514 -2.825964 -0.801644
H  -4.496047 1.31942 0.809937
H  -4.583058 -2.856654 -0.385168
H  -5.764276 -0.794268 0.417688
H  4.060875 -3.607558 1.469141
