program: Gaussian 09
title: 000117054
version: EM64L-G09RevD.01
frameworkgroup: C1[X(C13H24O4)]
method: RPBEPBE
basis: SDD
operation: Freq
keyword: #pfreq=noraman
keyword: PBEPBE/SDD
title: #p freq=noraman PBEPBE/SDD
converged: YES YES NO NO
title: Mulliken charges:
elementType: O O O O C C C C C C C C C C C C C H H H H H H H H H H H H H H H H H H H H H H H H
charge: -0.274828 -0.274830 -0.233056 -0.233049 -0.078829 -0.078868 -0.366240 -0.252519 -0.252506 -0.508661 -0.508657 -0.697985 -0.690569 -0.697934 -0.690566 0.245399 0.245402 0.214027 0.213991 0.237564 0.236382 0.218351 0.226221 0.226191 0.218400 0.238998 0.240303 0.239201 0.240093 0.209098 0.222150 0.215887 0.200675 0.238871 0.212611 0.209117 0.222154 0.215848 0.200681 0.238888 0.212595
chargesum: 0.00000
title: Mulliken charges with hydrogens summed into heavy atoms:
elementType: O O O O C C C C C C C C C C C C C
charge: -0.274828 -0.274830 -0.233056 -0.233049 0.135199 0.135123 0.107707 0.192053 0.192084 -0.029360 -0.029364 -0.050850 -0.038411 -0.050815 -0.038403 0.245399 0.245402
polarizability: 2.08623533e+02 -2.45991921e-02 1.42242287e+02 2.94988779e+00 8.61143853e-02 1.18956839e+02
1716.lowfreq: -14.2409 -9.2100 -0.0007 0.0005 0.0009 4.0084 5.9377 16.4074 28.9659
frequency: -14.2358 15.9698 28.9640 35.6657 36.3657 44.7205 48.0552 74.7650 79.7365 100.0859 127.1523 168.8179 181.1363 184.7543 207.6416 212.7076 213.2347 240.2837 244.5518 254.8063 265.8394 328.5919 329.4550 385.8369 397.2919 411.9162 412.8287 482.1348 523.9690 540.0539 553.7856 655.7602 687.0969 733.6736 817.1476 826.7107 846.7154 867.4510 870.9804 890.5690 897.9141 919.8829 922.6725 930.1613 940.1029 965.0712 965.3282 970.2606 973.2004 1060.1092 1063.3060 1077.1219 1117.4152 1136.2312 1136.4248 1141.3868 1141.7063 1151.3349 1151.4516 1190.6739 1190.8175 1228.3476 1228.5549 1251.3009 1255.2994 1282.7714 1293.0198 1293.8212 1330.9213 1338.1491 1341.3146 1358.1924 1362.6071 1375.5630 1377.3233 1378.2403 1398.0047 1398.0746 1438.7302 1444.7998 1462.7802 1462.8096 1469.8663 1469.8943 1473.9794 1474.2160 1474.6037 1483.3122 1483.3319 1490.6133 1490.7689 1641.1413 1644.5419 2972.5573 2972.5784 2976.0382 2976.0732 2984.8432 2986.1128 2987.7937 2987.8414 2995.2501 2995.3121 3027.0038 3029.7057 3034.2528 3058.8964 3059.0064 3064.3530 3064.3614 3073.1804 3073.2207 3078.3849 3078.4363 3089.2163 3091.5450 3091.6274
redmass: 4.7761 3.1005 4.9622 3.9853 4.9204 3.0172 1.7830 3.2898 4.0843 2.3772 4.4801 3.5327 2.5451 2.4527 2.9598 1.1687 1.1711 1.1249 1.1553 4.1425 3.4894 3.1213 3.1685 2.8170 2.5597 1.9949 1.9858 4.0921 3.9605 2.6397 2.6161 6.2239 6.0372 1.2636 3.0642 2.7052 1.5852 4.8535 3.6215 1.5283 1.5293 1.4050 1.2396 1.9665 2.4231 1.5996 1.6032 2.1556 2.3277 6.5978 1.9943 2.0319 4.2380 2.0345 2.0456 1.7597 1.8045 1.7362 1.7348 1.7289 1.7289 1.2707 1.2698 1.2557 1.4215 1.0654 1.3176 1.3394 1.5451 1.4346 1.5556 1.5316 1.6123 1.4909 1.2198 1.4004 1.2209 1.2214 1.0941 1.0771 1.0683 1.0682 1.0447 1.0447 1.0742 1.0647 1.0768 1.0479 1.0480 1.0591 1.0591 9.6805 10.1084 1.0358 1.0358 1.0374 1.0374 1.0608 1.0607 1.0774 1.0770 1.0627 1.0624 1.0610 1.0975 1.0994 1.1062 1.1062 1.0994 1.0994 1.1006 1.1006 1.0990 1.0990 1.1032 1.0992 1.0992
irintensity: 0.0020 0.0722 0.2336 0.1243 1.4252 0.1114 1.2875 1.1429 0.1494 0.0034 0.1944 0.0618 12.0044 0.0215 1.6662 1.2008 1.2018 0.2958 1.1990 18.2596 1.6508 18.8875 1.1612 0.2148 0.1525 0.0192 8.7521 0.0206 12.1677 0.0301 2.0392 0.0392 4.5085 15.6869 1.2454 1.9432 0.0539 0.3671 25.0044 0.5529 0.3379 0.8678 2.0438 70.8501 0.0279 0.1330 5.4810 146.7688 6.1356 10.1129 2.7702 7.7468 788.8234 0.7100 0.3736 18.2764 18.6020 1.6201 0.4283 5.9539 4.9362 3.1431 1.9719 38.4857 178.4758 0.0359 0.4702 1.1782 4.3370 0.8971 0.1459 0.8396 1.1040 27.1900 17.8494 51.7758 9.8858 15.0581 3.1916 34.9249 4.7151 0.7677 2.3399 0.9087 0.0327 0.9291 33.1846 18.2870 8.2773 22.0769 25.8355 22.3761 318.6066 39.2402 23.2412 37.7248 12.7275 10.9464 10.8607 7.1304 7.2109 24.8382 35.0986 10.6263 10.4734 0.0382 5.3778 5.4021 19.1744 15.9392 26.2266 129.8146 32.5777 79.6490 31.6949 53.8905 16.7753
temp: 298.150 k
press: 1.00000 atm
elementType: 8 8 8 8 6 6 6 6 6 6 6 6 6 6 6 6 6 1 1 1 1 1 1 1 1 1 1 1 1 1 1 1 1 1 1 1 1 1 1 1 1
symmnumber: 1
zpe: 921210.0 jmol-1
zpe.correction: 0.350870 hartree
zpe.thermalcorrener: 0.371744 hartree
zpe.thermalcorrenthalpy: 0.372688 hartree
zpe.thermalcorrgfe: 0.297588 hartree
zpe.sumelectzpe: -809.313349 hartree
zpe.sumelectthermal: -809.292475 hartree
zpe.sumelectthermalent: -809.291531 hartree
zpe.sumelectthermalfe: -809.366632 hartree
dipole: 0.0002 -3.6012 -0.0125
dipole: 3.6012
quadrupole: -78.7234 -116.8949 -101.6370
quadrupole: -0.0049 1.6978 -0.0263
quadrupole: 20.3617 -17.8098 -2.5518 -0.0049 1.6978 -0.0263
hfenergy: -809.6642193 hartree
pointgroup: C01 [X(C13H24O4)]
dipole: -0.0006367 -1.4166715 0.0208732 debye
polarizability: 208.6380088|-0.007791|142.2376955|2.7209234|-0.3392702|118.946955 unknown
InChI: InChI=1S/C13H24O4/c1-10(2)8-16-12(14)6-5-7-13(15)17-9-11(3)4/h10-11H,5-9H2,1-4H3
charge 0 multiplicity 1
41 atoms
O  3.660341 -0.309216 0.15793
O  -3.663927 -0.311163 -0.167409
O  2.6356 1.78223 0.068762
O  -2.636984 1.781003 -0.147359
C  6.068412 -0.7346 0.213771
C  -6.072808 -0.734834 -0.197861
C  -0.001425 0.584637 -0.017335
C  4.99449 0.36175 0.214419
C  -4.997641 0.35944 -0.237629
C  1.26669 -0.28729 0.037273
C  -1.269411 -0.287925 -0.06442
C  7.455597 -0.084409 0.434946
C  6.033254 -1.560886 -1.091679
C  -7.460633 -0.089785 -0.429947
C  -6.030748 -1.521926 1.131415
C  2.546851 0.533714 0.086823
C  -2.54933 0.532419 -0.12857
H  5.855124 -1.411571 1.065445
H  -5.865535 -1.437251 -1.030207
H  0.033865 1.248807 -0.898617
H  -0.036842 1.256127 0.858494
H  5.088738 1.032779 -0.660841
H  5.031552 0.979941 1.130804
H  -5.038942 0.949183 -1.172399
H  -5.086522 1.057145 0.61706
H  1.327835 -0.958368 -0.842524
H  1.256995 -0.955563 0.920857
H  -1.333347 -0.949132 0.822445
H  -1.256895 -0.966046 -0.940615
H  7.696907 0.621197 -0.383194
H  8.245389 -0.856693 0.45431
H  7.500569 0.471621 1.390058
H  6.265688 -0.921378 -1.965396
H  5.037114 -2.009388 -1.248048
H  6.780368 -2.374848 -1.060219
H  -7.696938 0.639099 0.369016
H  -8.251124 -0.861575 -0.422974
H  -7.510432 0.438764 -1.400302
H  -6.256993 -0.856337 1.987089
H  -5.034194 -1.966919 1.295078
H  -6.779012 -2.33545 1.128854
