program: Gaussian 09
title: 000117050
version: EM64L-G09RevD.01
frameworkgroup: C1[X(C11H9ClN2O3)]
method: RPBEPBE
basis: SDD
operation: Freq
keyword: #p
keyword: freq=noraman
keyword: PBEPBE/SDD
title: #p freq=noraman PBEPBE/SDD
converged: YES YES NO NO
title: Mulliken charges:
elementType: Cl O O O N N C C C C C C C C C C C H H H H H H H H H
charge: -0.087302 -0.212132 -0.197264 -0.152056 -0.212888 -0.175973 0.052736 0.220566 0.369840 0.123706 0.086800 -0.399630 -0.305882 -0.195984 -0.603267 -0.639839 -0.027960 0.276474 0.269441 0.245023 0.262452 0.251367 0.255467 0.296429 0.232850 0.267026
chargesum: 0.00000
title: Mulliken charges with hydrogens summed into heavy atoms:
elementType: Cl O O O N N C C C C C C C C C C C
charge: -0.087302 -0.212132 -0.197264 -0.152056 -0.212888 -0.175973 0.052736 0.220566 0.369840 0.123706 0.086800 -0.123156 -0.036441 0.049040 0.166019 0.156465 -0.027960
polarizability: 1.95169078e+02 9.37366424e+00 1.68716152e+02 8.90275393e+00 1.95933907e+00 9.62539301e+01
1716.lowfreq: -9.9198 -4.5819 -0.0008 0.0010 0.0013 6.5348 25.9563 58.5730 63.8661
frequency: 25.9156 58.5673 63.8610 69.4120 111.1568 115.3405 124.1132 156.7718 171.8626 218.1262 238.7384 257.9075 265.7307 288.9167 325.2445 355.0384 373.6310 412.5524 419.0267 457.4521 504.1954 553.0168 571.3557 595.8327 607.6923 675.3207 689.8577 731.1971 737.6242 777.2705 824.3512 825.5493 863.5716 937.2262 958.1417 988.6723 998.2330 1036.8456 1057.3674 1108.9422 1127.4056 1127.5259 1164.1932 1188.9675 1227.2022 1234.9893 1256.4617 1331.7898 1350.5323 1415.7538 1420.1828 1426.7266 1440.4880 1464.2451 1469.9048 1472.9637 1482.8546 1499.6105 1603.7837 1618.8463 1625.0905 1676.0279 1733.3625 3002.3098 3003.8523 3095.8764 3102.3667 3122.1342 3130.8187 3149.6942 3165.6995 3178.3041
redmass: 8.1975 4.2998 10.2495 1.2229 4.0238 1.8771 2.6119 2.4712 6.0914 4.5107 4.5242 4.3602 3.9423 6.5009 10.7977 5.5161 6.7623 11.7581 6.6184 4.7998 6.1388 6.5775 5.0283 12.6377 10.9136 4.3504 6.2169 5.8373 6.8730 2.9404 3.3961 2.7774 5.8419 1.3959 6.9389 2.7721 1.3685 3.0016 2.1796 1.9455 1.4286 1.3200 1.8978 1.6554 2.5736 4.2376 2.1678 3.9949 6.0452 5.1880 1.9160 1.3593 1.5111 1.0982 1.0420 2.4948 1.0681 1.0837 8.9048 7.8341 11.4427 11.4635 11.3982 1.0329 1.0329 1.1023 1.1039 1.1018 1.1016 1.0876 1.0930 1.0996
irintensity: 1.4255 0.8105 1.1128 0.1586 6.0834 2.9671 1.6511 0.3529 4.1623 2.4632 0.7548 0.7449 3.8559 5.1131 10.5476 1.6866 26.6912 2.2544 21.7801 0.8896 13.0509 7.4962 16.1103 1.9820 15.2860 23.1561 1.5845 3.7836 50.8084 8.6944 2.1506 36.2617 28.4359 3.0834 20.9816 109.2358 0.3855 35.7107 0.4446 131.9361 13.1138 1.4831 11.1777 28.8630 38.0210 44.6994 49.0332 56.0856 188.3000 4.8885 4.2074 49.8199 93.9419 15.4974 18.4934 53.9919 10.4451 35.6100 19.3833 67.7694 446.2704 71.6171 497.2728 28.5192 29.1515 15.3420 7.4562 0.8533 1.6609 3.9303 1.5406 7.3767
temp: 298.150 k
press: 1.00000 atm
elementType: 17 8 8 8 7 7 6 6 6 6 6 6 6 6 6 6 6 1 1 1 1 1 1 1 1 1
symmnumber: 1
zpe: 483659.7 jmol-1
zpe.correction: 0.184216 hartree
zpe.thermalcorrener: 0.200131 hartree
zpe.thermalcorrenthalpy: 0.201075 hartree
zpe.thermalcorrgfe: 0.139567 hartree
zpe.sumelectzpe: -1218.634409 hartree
zpe.sumelectthermal: -1218.618494 hartree
zpe.sumelectthermalent: -1218.617550 hartree
zpe.sumelectthermalfe: -1218.679058 hartree
dipole: 2.3248 2.0520 -3.3192
dipole: 4.5423
quadrupole: -124.2262 -98.1574 -101.9206
quadrupole: -13.3561 7.8390 -1.3500
quadrupole: -16.1248 9.9440 6.1808 -13.3561 7.8390 -1.3500
hfenergy: -1218.8186251 hartree
pointgroup: C01 [X(C11H9Cl1N2O3)]
dipole: -0.9230323 0.990293 1.166603 debye
dipolederiv: -0.285406 0.0825029 -0.1421827 0.0950664 -0.2116415 0.2672549 -0.0009579 0.2245154 -0.8483584 -0.698113 0.1753066 -0.0769895 0.2686446 -0.8587648 0.131277 -0.1300646 0.0891095 -0.3452869 -1.1757771 0.1667119 -0.0798664 0.0547027 -0.5207116 0.0324459 -0.1070165 0.0384911 -0.3342126 -1.2914942 0.3796597 -0.0512783 0.4625668 -0.4595041 0.1075544 -0.0813577 0.1100084 -0.564047 -1.2254955 0.0827321 -0.1049478 0.136427 -0.9754805 0.1213221 -0.1384876 0.1085574 -0.2201962 -0.9991544 0.1639895 0.2562021 0.2916856 -0.3414092 0.0423751 0.4528527 0.0485906 -0.8985366 -0.1689395 -0.075167 0.0175961 -0.1626368 -0.5077003 0.052237 0.0986322 0.0549996 -0.0401097 -0.3730231 -0.1994145 0.0193873 -0.2134575 -0.1540653 -0.0042321 0.0160963 -0.004953 0.0181615 0.8399431 -0.1141229 -0.0064816 -0.5534859 0.2724491 0.0853663 0.0322751 -0.0084617 0.0313509 1.5246395 -0.1104713 0.1248109 0.0133214 1.1493842 -0.1830871 0.1556611 -0.1450371 0.2750202 1.4530123 -0.1839085 0.1182535 -0.1551266 1.236151 -0.1574448 0.1658168 -0.1384003 0.2514636 0.0134326 -0.1496455 0.0498961 -0.061064 -0.0227976 -0.0062628 0.0134178 -0.0318093 -0.0943217 -0.031247 0.0955517 0.0077013 0.2258406 -0.1093066 -0.0166313 -0.1819925 0.0142629 -0.0914809 -0.0033246 0.0203245 -0.0117835 0.040851 0.179375 -0.0470496 0.0100629 -0.0563887 -0.1131227 0.2052249 0.2272925 -0.0299592 0.1786929 0.3479185 -0.0056626 -0.0200077 0.0115245 0.2020707 -0.1498252 0.058629 0.0705569 -0.0544881 0.1865543 -0.1124789 0.035017 -0.0687912 0.4220854 1.9291485 -0.5768465 -0.1814556 -0.5210065 0.4908458 -0.3451189 -0.44964 -0.2507625 1.7356063 0.0199412 0.0696619 -0.0210374 0.0291579 0.0799801 0.0143362 -0.0168595 0.0210084 0.1540622 -0.0210677 -0.0529144 -0.0103612 -0.0494572 0.0843653 0.0083987 0.0009591 0.005844 0.13009 0.0803633 -0.018965 -0.0015194 -0.0070609 -0.079708 0.0252324 0.0075413 0.0352838 0.1486546 -0.0234337 -0.0295922 -0.0108067 0.1006355 0.1134859 0.0106942 -0.0272275 -0.0014492 0.1275531 0.0853617 -0.0132049 -0.0542085 -0.0616582 0.0041042 0.0545725 0.0128431 0.0921331 -0.0605907 0.0713538 0.0210169 0.0745819 -0.0470879 -0.0303933 -0.0651992 0.0236048 -0.0941324 -0.006157 0.1443458 -0.1045164 0.0526365 -0.0587043 0.0232232 0.0601104 0.0808622 -0.0237492 0.0453924 0.1192354 0.0425769 0.0708096 0.0179902 -0.0128666 -0.097575 0.0506776 -0.0388532 -0.0501989 -0.0397011 0.0428131 -0.0795543 0.0296514 0.1165129 0.0275653 -0.0027083 0.0084593 0.1251085 unknown
polarizability: 198.2164171|-4.4382733|161.6342308|2.2443519|-17.8917051|100.2885123 unknown
InChI: InChI=1S/C11H9ClN2O3/c1-13(11(12)17)7-5-3-4-6-8(7)10(16)14(2)9(6)15/h3-5H,1-2H3
charge 0 multiplicity 1
26 atoms
Cl 2.739225 0.520115 -2.183489
O  -0.017524 -2.299332 0.558329
O  -3.876745 0.275631 -0.212688
O  4.262383 -0.719091 -0.271568
N  -2.130637 -1.297337 0.170528
N  2.170071 0.047417 0.467185
C  -0.308945 0.15863 0.18748
C  -1.479625 0.928078 -0.036008
C  0.9558 0.777691 0.199059
C  -0.718656 -1.280357 0.332552
C  -2.662345 0.00737 -0.046733
C  -1.439547 2.31299 -0.236904
C  1.007041 2.186761 0.00824
C  -0.166599 2.940546 -0.209121
C  -2.942385 -2.51592 0.225565
C  2.329687 -0.56694 1.81809
C  3.176617 -0.156492 -0.44833
H  -2.359467 2.879235 -0.410426
H  1.982402 2.682624 0.025488
H  -0.087336 4.02234 -0.356492
H  -3.994877 -2.224001 0.082059
H  -2.823238 -3.016588 1.201178
H  -2.63896 -3.217948 -0.569255
H  1.729122 -1.489911 1.879433
H  2.005108 0.155395 2.584894
H  3.392733 -0.809606 1.965034
