program: Gaussian 09
title: 000117039
version: EM64L-G09RevD.01
frameworkgroup: C1[X(C12H20OS)]
method: RPBEPBE
basis: SDD
operation: Freq
keyword: #p
keyword: freq=noraman
keyword: PBEPBE/SDD
title: #p freq=noraman PBEPBE/SDD
converged: YES YES NO NO
title: Mulliken charges:
elementType: S O C C C C C C C C C C C C H H H H H H H H H H H H H H H H H H H H
charge: 0.131194 -0.188910 -0.536792 -0.471693 0.448972 -0.279250 -0.246769 -0.832049 0.369046 -0.764900 -0.783381 -0.790907 -0.013525 -0.701493 0.205130 0.222978 0.206287 0.209312 0.228630 0.242662 0.227407 0.228439 0.235588 0.309371 0.265235 0.213501 0.216105 0.230220 0.218405 0.224845 0.221150 0.250674 0.250677 0.253839
chargesum: 0.00000
title: Mulliken charges with hydrogens summed into heavy atoms:
elementType: S O C C C C C C C C C C C C
charge: 0.131194 -0.188910 -0.108684 -0.056094 0.448972 -0.050620 -0.004107 -0.140615 0.369046 -0.190294 -0.123554 -0.126508 -0.013525 0.053699
polarizability: 2.17428415e+02 -1.18726460e+01 1.59034332e+02 3.14099565e+00 9.29016708e-01 1.10767315e+02
1716.lowfreq: -61.5350 -14.9768 -3.3532 -0.0011 0.0007 0.0021 4.1077 11.3984 14.0661
frequency: -61.5334 -5.9713 13.7677 23.7068 42.7356 43.1537 69.3767 97.1327 116.9853 130.8073 142.3348 157.1650 190.0089 196.7449 279.6606 292.8820 320.1784 346.6972 376.6208 399.9118 437.5689 449.5628 461.7684 480.1849 501.0743 511.7896 550.3134 586.0626 631.3823 738.9995 755.7763 835.3540 852.1841 900.7671 912.1363 925.9305 944.9689 947.1735 989.1090 993.4458 1013.5268 1016.4760 1027.0351 1043.4462 1081.7365 1106.0244 1119.7701 1121.7421 1151.4624 1167.5970 1190.8256 1235.6062 1245.5136 1250.2273 1303.7287 1325.8478 1365.9318 1369.1962 1372.1199 1387.2336 1393.6958 1397.8787 1447.0217 1451.4954 1452.1443 1453.8472 1456.4807 1461.3016 1466.4605 1471.3960 1473.4044 1476.7722 1480.5263 1634.1325 1674.3512 1694.6521 2954.6855 2956.0228 2960.6893 2963.6932 2969.2805 2997.1755 3006.3187 3026.9816 3031.0221 3034.8859 3039.3406 3045.7828 3075.1597 3081.8715 3089.0302 3090.8615 3092.7339 3096.8387 3117.0516 3124.9825
redmass: 1.0828 2.6978 4.1500 5.9372 2.9366 3.6977 3.2796 1.6285 1.0975 2.9626 1.7787 4.2766 2.7625 1.2604 2.7803 2.2601 2.3896 2.7547 2.9397 2.2075 2.5368 3.6175 4.4966 2.8676 3.3798 2.7161 2.2256 4.0751 4.7215 2.4389 2.3078 1.2659 1.9375 1.7262 1.6515 1.9592 2.2488 1.4343 2.0372 1.2544 1.6806 1.6307 1.7094 1.7056 1.6692 2.1337 2.4571 2.2048 1.5865 1.1658 1.4091 1.8676 1.5735 1.2065 1.3350 1.4683 1.3624 1.4011 1.2217 1.3065 1.3109 1.2251 1.0685 1.0468 1.0779 1.0875 1.0586 1.1008 1.0526 1.0489 1.0644 1.0777 1.0795 8.7857 6.5621 6.4908 1.0632 1.0381 1.0616 1.0409 1.0413 1.0353 1.0644 1.0970 1.0963 1.0929 1.0959 1.0965 1.0948 1.0925 1.0976 1.0970 1.0956 1.0912 1.0979 1.1013
irintensity: 1.4544 0.0551 0.1548 0.2306 0.4618 0.5486 1.6901 1.3171 0.8823 4.0897 1.7707 2.6832 1.7149 0.1593 2.2260 1.8753 2.2796 1.8785 0.8259 1.3627 1.5085 8.9876 2.3520 16.9193 0.0574 4.3651 7.0633 91.8190 45.0340 5.5176 5.6234 9.8285 13.5840 8.6445 18.0777 3.3863 49.8720 3.1690 0.8250 3.2517 19.0726 9.3065 2.1310 17.3356 3.5386 3.4792 200.8742 15.9609 0.3823 0.8775 1.5098 8.5966 6.6311 9.1056 2.3367 0.8846 0.5239 0.2834 50.0724 29.3189 23.7416 10.8295 32.3396 23.6765 5.8367 9.5895 1.2510 10.0111 29.3426 10.3145 20.0900 9.8393 13.1918 196.8590 20.1560 8.3297 29.7706 31.1558 41.3351 51.6866 51.0493 2.4100 21.6214 8.3000 45.7584 22.8474 25.0898 42.9693 3.4024 53.0935 6.4020 27.2720 37.0129 5.1758 28.3540 14.1341
temp: 298.150 k
press: 1.00000 atm
elementType: 16 8 6 6 6 6 6 6 6 6 6 6 6 6 1 1 1 1 1 1 1 1 1 1 1 1 1 1 1 1 1 1 1 1
symmnumber: 1
zpe: 754726.6 jmol-1
zpe.correction: 0.287460 hartree
zpe.thermalcorrener: 0.304506 hartree
zpe.thermalcorrenthalpy: 0.305450 hartree
zpe.thermalcorrgfe: 0.239385 hartree
zpe.sumelectzpe: -941.425264 hartree
zpe.sumelectthermal: -941.408218 hartree
zpe.sumelectthermalent: -941.407274 hartree
zpe.sumelectthermalfe: -941.473339 hartree
dipole: 0.6614 -1.3704 -0.6096
dipole: 1.6392
quadrupole: -81.1661 -97.0460 -92.8653
quadrupole: 1.4164 2.3611 -3.1611
quadrupole: 9.1930 -6.6868 -2.5062 1.4164 2.3611 -3.1611
hfenergy: -941.7127238 hartree
pointgroup: C01 [X(C12H20O1S1)]
dipole: 0.2729092 -0.5671994 -0.1404215 debye
polarizability: 218.1641533|-9.5990275|157.1348816|3.3777728|-7.6545642|111.9310269 unknown
InChI: InChI=1S/C12H20OS/c1-10(2)6-5-7-11(3)8-9-14-12(4)13/h6,8H,5,7,9H2,1-4H3
charge 0 multiplicity 1
34 atoms
S  -3.624668 -0.82161 0.109736
O  -3.984818 1.908154 0.111878
C  1.323796 -1.629308 -0.710808
C  2.740864 -1.258361 -0.162875
C  0.184792 -1.420358 0.281509
C  2.877739 0.213115 0.170447
C  -0.803963 -0.516085 0.008562
C  0.244468 -2.270411 1.539074
C  3.863517 1.075331 -0.214113
C  -1.980035 -0.171195 0.870702
C  3.832128 2.533984 0.218016
C  5.059294 0.700513 -1.07331
C  -4.489442 0.802802 -0.186154
C  -5.856099 0.621771 -0.823152
H  1.346867 -2.700107 -1.006061
H  1.133795 -1.040618 -1.627647
H  3.493406 -1.568033 -0.910889
H  2.94139 -1.868891 0.743015
H  2.065896 0.617642 0.794944
H  -0.75215 0.035926 -0.940612
H  0.449361 -3.326645 1.277736
H  -0.688932 -2.243512 2.124384
H  1.067305 -1.944148 2.205216
H  -2.150095 0.920366 0.928588
H  -1.932938 -0.591999 1.88518
H  4.742712 2.799649 0.791826
H  3.805315 3.208774 -0.661138
H  2.953028 2.756714 0.847181
H  5.122698 1.360487 -1.961316
H  5.031995 -0.343274 -1.425988
H  6.003096 0.84107 -0.509009
H  -6.509208 0.024111 -0.162395
H  -5.764575 0.077985 -1.780112
H  -6.315538 1.60676 -1.000315
