program: Gaussian 09
title: 000117034
version: EM64L-G09RevD.01
frameworkgroup: C1[X(C17H19NO6)]
method: RPBEPBE
basis: SDD
operation: Freq
keyword: #p
keyword: freq=noraman
keyword: PBEPBE/SDD
title: #p freq=noraman PBEPBE/SDD
converged: YES YES NO NO
title: Mulliken charges:
elementType: O O O O O O N C C C C C C C C C C C C C C C C C H H H H H H H H H H H H H H H H H H H
charge: -0.271939 -0.217624 -0.228944 -0.221917 -0.218545 -0.270258 0.011810 -0.574373 0.476192 -0.303696 0.192882 -0.535465 0.196450 -0.530006 0.220216 0.347803 -0.353308 -0.344103 -0.327164 -0.351524 0.313892 -0.536408 -0.537304 -0.537059 0.224687 0.267170 0.252382 0.205351 0.261510 0.301784 0.250248 0.245890 0.250477 0.236879 0.228965 0.229477 0.256107 0.251592 0.228170 0.230796 0.243076 0.216576 0.219254
chargesum: 0.00000
title: Mulliken charges with hydrogens summed into heavy atoms:
elementType: O O O O O O N C C C C C C C C C C C C C C C C C
charge: -0.271939 -0.217624 -0.228944 -0.221917 -0.218545 -0.270258 0.011810 -0.082516 0.476192 0.154036 0.192882 -0.273955 0.196450 -0.228221 0.220216 0.347803 -0.103060 -0.098213 -0.076687 -0.114645 0.313892 0.178141 0.173254 0.141847
polarizability: 3.17007553e+02 1.03078820e+01 2.19606899e+02 1.75338093e+01 -7.11803416e+00 1.71831295e+02
1716.lowfreq: -5.1020 -2.8118 -2.2692 -0.0002 0.0004 0.0008 14.1936 23.0872 25.4470
frequency: 14.1767 23.0709 25.4336 48.2733 52.6641 69.5252 87.6257 94.5291 121.2877 143.4095 155.3838 159.5074 165.3094 168.9476 182.5482 194.1177 212.1119 240.7485 241.4832 266.3933 286.4965 303.2496 321.6434 348.0270 362.9378 371.0391 386.0963 417.8329 419.5583 462.8043 476.2683 487.5551 507.9804 515.3227 530.8975 587.4566 625.0623 635.6873 641.1957 699.5093 713.5473 715.8644 736.6642 738.2308 748.1285 788.9605 802.1112 823.2454 828.0791 832.7326 871.7448 891.5549 904.9046 944.4884 953.3695 981.5475 983.9885 990.1586 999.1924 1040.1323 1051.1301 1068.1128 1109.3051 1110.5554 1113.5109 1113.5328 1150.5310 1154.9917 1157.6188 1175.7033 1176.9430 1178.8075 1198.0111 1204.2425 1206.8444 1236.1083 1266.0760 1273.8312 1286.1535 1295.6132 1297.7334 1338.8540 1370.4627 1385.0736 1394.3574 1417.5841 1425.2579 1436.2364 1436.6548 1443.1532 1465.0545 1468.0194 1469.1228 1469.4035 1469.6269 1471.4095 1473.6411 1482.1309 1498.2495 1512.4541 1572.7035 1588.9920 1608.0383 1625.5344 2952.0440 2953.0869 2968.1952 2971.8270 3015.7425 3036.0836 3036.8384 3059.6337 3065.5036 3094.6606 3120.6814 3136.6762 3138.6973 3148.1614 3153.2960 3156.3214 3168.2213 3175.0956 3188.8653
redmass: 6.1048 4.6838 3.9650 7.2875 4.8813 6.7309 3.4308 3.7999 4.7377 4.3685 4.7516 3.5660 3.8709 3.0423 3.0216 2.4657 2.0812 1.2053 1.4049 1.7378 4.4374 3.7311 6.1752 3.6238 5.8664 5.4162 4.9207 3.2468 4.8571 3.5345 6.0470 4.2403 5.9200 2.3419 6.5322 6.1663 6.4369 4.3345 7.0335 6.3191 3.5782 8.0902 5.9061 9.1044 2.9045 1.3160 4.8814 1.3239 1.5832 3.9799 1.7415 1.4710 1.3765 8.2635 1.3361 8.0220 6.0907 5.7890 2.9384 5.2052 1.6182 3.5679 1.2669 1.2605 1.2605 1.2609 1.6047 1.3362 1.4261 1.2301 2.0993 1.6102 2.8027 2.9591 3.4154 5.4613 1.2647 4.2943 1.2079 1.3883 1.2990 8.5193 1.9484 2.6319 3.6848 5.0707 3.8284 1.1774 1.1905 1.3929 1.0501 1.1042 1.0518 1.0873 1.0708 1.0659 1.1049 1.1738 1.8600 3.2411 8.9530 7.7629 6.9732 6.3785 1.0391 1.0538 1.0327 1.0325 1.0658 1.0978 1.1036 1.1043 1.1045 1.1005 1.0988 1.1001 1.1002 1.0867 1.0878 1.0904 1.0954 1.0975 1.0903
irintensity: 0.7805 0.1765 1.3414 0.7173 0.3761 1.1677 7.6175 2.0407 4.3501 1.5946 2.2022 2.7837 7.7734 10.8579 1.7802 1.9687 0.6745 0.6535 1.8222 1.0400 1.1663 4.9909 1.0980 0.7391 0.2144 1.3840 2.9579 1.6626 9.4175 0.7230 2.8013 5.5378 1.6023 18.7166 1.0088 12.5117 2.4739 4.0487 10.8712 32.3315 0.0285 11.6691 24.4991 22.4206 3.5291 19.9257 6.3413 6.6027 64.0502 1.8885 17.7884 37.8709 0.0432 19.1873 0.0098 81.8485 21.3499 29.7974 81.7525 86.7288 1.9812 27.3020 15.4842 0.1681 0.2293 0.0896 20.5798 1.7012 35.7262 6.9661 146.1615 91.3457 445.2935 367.4095 187.3926 12.7563 10.2626 238.3657 0.7880 10.3448 4.9529 106.4434 13.1483 13.5665 87.5158 8.9531 4.0342 49.6833 11.9104 14.1537 12.6903 83.7884 4.4346 21.0824 50.2728 68.4677 92.5542 79.1091 194.0455 194.4971 82.7711 10.4155 77.1179 4.4197 42.6161 60.1736 59.4656 47.0678 12.5015 14.3117 56.8105 37.1138 38.7051 8.0739 30.3988 17.7431 19.4116 21.1672 4.4838 6.4452 14.6262 2.9584 6.7270
temp: 298.150 k
press: 1.00000 atm
elementType: 8 8 8 8 8 8 7 6 6 6 6 6 6 6 6 6 6 6 6 6 6 6 6 6 1 1 1 1 1 1 1 1 1 1 1 1 1 1 1 1 1 1 1
symmnumber: 1
zpe: 876436.9 jmol-1
zpe.correction: 0.333817 hartree
zpe.thermalcorrener: 0.357429 hartree
zpe.thermalcorrenthalpy: 0.358373 hartree
zpe.thermalcorrgfe: 0.278064 hartree
zpe.sumelectzpe: -1163.382307 hartree
zpe.sumelectthermal: -1163.358696 hartree
zpe.sumelectthermalent: -1163.357752 hartree
zpe.sumelectthermalfe: -1163.438061 hartree
dipole: 2.8481 5.0458 2.7751
dipole: 6.4244
quadrupole: -127.6356 -147.5853 -129.3872
quadrupole: 4.4786 -9.6336 -7.9837
quadrupole: 7.2338 -12.7160 5.4822 4.4786 -9.6336 -7.9837
hfenergy: -1163.7161246 hartree
pointgroup: C01 [X(C17H19N1O6)]
dipole: -1.0580578 2.2619898 -0.3903305 debye
polarizability: 316.4988559|-18.1939424|211.762272|10.9173982|19.9245874|180.1846188 unknown
InChI: InChI=1S/C17H19NO6/c1-21-13-4-6-14(7-5-13)24-9-8-12-10-16(22-2)17(23-3)11-15(12)18(19)20/h4-7,10-11H,8-9H2,1-3H3
charge 0 multiplicity 1
43 atoms
O  1.978894 -0.36125 1.258991
O  -4.119831 2.744946 0.70149
O  -5.517899 1.106763 -0.838787
O  -2.955485 -3.201556 -1.046317
O  -0.853657 -2.757123 -0.296344
O  7.164987 0.385278 -0.821909
N  -2.085206 -2.408704 -0.50234
C  -0.413563 -0.532568 1.360063
C  -1.753892 -0.202771 0.717163
C  0.773326 -0.22147 0.429247
C  -2.523978 -1.052622 -0.122706
C  -2.309382 1.073809 0.992759
C  -3.546223 1.505193 0.468966
C  -3.784035 -0.654553 -0.646714
C  -4.304517 0.615246 -0.368756
C  3.223679 -0.153816 0.63291
C  4.358595 -0.299529 1.472841
C  3.396236 0.17946 -0.729206
C  5.648578 -0.113053 0.954777
C  4.699914 0.367055 -1.253442
C  5.826854 0.222078 -0.413313
C  -3.386944 3.69489 1.550872
C  -6.319364 0.209608 -1.681811
C  7.397673 0.719207 -2.226314
H  -0.293651 0.083441 2.269826
H  -0.347965 -1.592484 1.651676
H  0.800128 -0.937414 -0.413901
H  0.709225 0.815288 0.035904
H  -1.742695 1.740146 1.650076
H  -4.321549 -1.375911 -1.265324
H  4.204953 -0.562383 2.523812
H  2.537477 0.29099 -1.397722
H  6.533892 -0.223789 1.58806
H  4.811984 0.620908 -2.311832
H  -2.402496 3.943435 1.111372
H  -3.25445 3.293534 2.573298
H  -4.021533 4.59149 1.580107
H  -7.218733 0.788411 -1.934706
H  -5.773772 -0.062906 -2.60545
H  -6.602549 -0.707265 -1.130455
H  8.49029 0.797552 -2.327932
H  6.928651 1.686575 -2.495839
H  7.017333 -0.074535 -2.89969
