program: Gaussian 09
title: 000117010
version: EM64L-G09RevD.01
frameworkgroup: C1[X(C10H12F3NO)]
method: RPBEPBE
basis: SDD
operation: Freq
keyword: #p
keyword: freq=noraman
keyword: PBEPBE/SDD
title: #p freq=noraman PBEPBE/SDD
converged: YES YES NO NO
title: Mulliken charges:
elementType: F F F O N C C C C C C C C C C H H H H H H H H H H H H
charge: -0.166599 -0.166985 -0.169118 -0.431339 -0.098252 -0.247596 0.531831 -0.447677 -0.315582 0.298778 -0.372371 -0.321008 -0.630050 -0.640193 0.256073 0.189335 0.239159 0.279987 0.263977 0.258169 0.189108 0.229624 0.251343 0.182760 0.255489 0.231207 0.349929
chargesum: 0.00000
title: Mulliken charges with hydrogens summed into heavy atoms:
elementType: F F F O N C C C C C C C C C C
charge: -0.166599 -0.166985 -0.169118 -0.081411 -0.098252 -0.058261 0.531831 -0.208518 -0.035595 0.298778 -0.108394 -0.062839 0.040024 0.029263 0.256073
polarizability: 1.62345957e+02 3.47764879e+00 9.34142152e+01 2.23131295e+00 -1.33539724e+01 1.02129649e+02
1716.lowfreq: -20.8665 -16.3073 -0.0010 -0.0009 0.0003 5.8947 7.0770 29.1318 54.6733
frequency: -20.0411 29.0364 54.6199 68.0757 113.2707 139.5866 150.8186 194.1338 213.4139 238.2855 247.5868 261.2040 308.1444 325.5449 365.0338 384.6870 398.2515 406.2971 431.7942 498.1666 514.3948 538.7361 584.3270 616.0458 629.2869 701.6462 747.3189 808.2125 835.8942 852.5929 860.9692 961.3076 975.7874 983.6014 986.3768 992.4140 1005.1438 1021.5584 1029.6884 1033.3438 1090.2428 1125.5397 1132.2534 1158.9702 1191.4943 1207.8688 1219.6328 1253.5196 1280.7712 1305.2869 1317.8918 1370.4581 1399.3158 1409.3949 1414.6111 1441.4905 1464.9603 1471.1910 1480.4620 1491.5798 1506.2869 1592.4962 1626.5340 2783.5893 2842.2018 2866.5389 3037.5788 3044.7734 3095.8603 3104.9934 3131.7011 3150.9563 3171.2398 3175.2838 3566.4924
redmass: 8.6229 4.0924 5.0699 2.6912 4.8536 4.3367 1.5278 6.7504 1.5246 1.5305 2.0789 3.7588 3.3015 2.5016 7.8703 2.9799 3.2311 4.1354 3.8562 5.3548 11.1193 4.7885 3.2134 8.4598 7.0867 6.3218 4.0192 4.1217 2.2239 1.2759 2.4999 1.9427 3.4383 1.8481 2.9162 7.3203 2.6218 5.1722 2.9310 1.5106 1.2649 1.4029 1.3896 1.4704 1.1232 3.5581 1.4944 2.4719 4.0915 1.4026 1.2538 2.1797 4.1188 2.2881 1.1877 1.1772 1.0477 1.0507 1.0521 1.0535 2.7676 7.1457 6.4371 1.0809 1.0581 1.0572 1.0725 1.0713 1.1007 1.1005 1.0899 1.0893 1.0947 1.0967 1.0669
irintensity: 0.1411 0.9511 0.4313 8.4145 6.0272 23.0522 59.9087 6.3951 3.0264 11.5089 7.9770 1.2915 14.7465 7.8487 0.8949 3.0863 5.7552 6.0232 4.0974 0.7405 0.3476 7.0726 13.3473 1.0735 0.2143 2.0932 1.7513 53.1482 76.6977 0.1863 86.4014 1.9785 117.8213 35.8601 113.6195 159.3944 110.5346 129.3067 69.7379 5.1169 3.1764 1.4650 18.1922 25.1385 6.8102 36.4666 9.2627 26.1755 350.8328 8.5621 20.0612 14.9332 5.4711 27.0799 1.8486 13.5548 17.1353 4.6968 8.0735 27.9952 3.2930 1.2947 14.8050 83.1993 112.3860 163.4888 28.2409 34.6645 30.0869 18.8172 9.3293 1.6906 4.2206 0.3149 8.9197
temp: 298.150 k
press: 1.00000 atm
elementType: 9 9 9 8 7 6 6 6 6 6 6 6 6 6 6 1 1 1 1 1 1 1 1 1 1 1 1
symmnumber: 1
zpe: 534910.5 jmol-1
zpe.correction: 0.203737 hartree
zpe.thermalcorrener: 0.218191 hartree
zpe.thermalcorrenthalpy: 0.219135 hartree
zpe.thermalcorrgfe: 0.161696 hartree
zpe.sumelectzpe: -816.607181 hartree
zpe.sumelectthermal: -816.592727 hartree
zpe.sumelectthermalent: -816.591783 hartree
zpe.sumelectthermalfe: -816.649222 hartree
dipole: -5.8391 -0.5004 2.2494
dipole: 6.2773
quadrupole: -87.0063 -85.7294 -86.5399
quadrupole: 1.3615 -3.3074 -4.9514
quadrupole: -0.5811 0.6958 -0.1147 1.3615 -3.3074 -4.9514
hfenergy: -816.8109181 hartree
pointgroup: C01 [X(C10H12F3N1O1)]
dipole: 2.2825784 0.4009801 -0.8534917 debye
polarizability: 162.4427883|-2.9192768|83.6182773|-0.7914361|-0.1578672|111.8287549 unknown
InChI: InChI=1S/C10H12F3NO/c1-14(2)9(15)7-3-5-8(6-4-7)10(11,12)13/h3-6,9,15H,1-2H3
charge 0 multiplicity 1
27 atoms
F  -3.958358 0.099917 -1.049986
F  -3.76053 -1.051813 0.896133
F  -3.603405 1.203149 0.900703
O  2.868882 -1.778163 -0.23114
N  3.294345 0.522422 0.39679
C  2.558934 -0.370691 -0.531072
C  1.052013 -0.222948 -0.370732
C  0.209983 -0.095094 -1.496996
C  0.483479 -0.271879 0.926677
C  -1.747018 -0.058011 -0.043799
C  -1.190012 -0.009368 -1.340449
C  -0.910563 -0.190649 1.093707
C  3.044944 1.950968 0.100705
C  4.736364 0.209117 0.471599
C  -3.230103 0.043774 0.159456
H  2.845206 -0.158385 -1.599947
H  0.64464 -0.064308 -2.502841
H  1.152453 -0.365683 1.78683
H  -1.842159 0.09248 -2.212537
H  -1.351093 -0.232245 2.095208
H  3.428605 2.26605 -0.902778
H  3.540125 2.574012 0.865223
H  1.963698 2.163922 0.136881
H  5.263734 0.301433 -0.51391
H  4.875972 -0.812038 0.859993
H  5.218647 0.908615 1.175417
H  3.647918 -2.066785 -0.770635
