program: Gaussian 09
title: 000117001
version: EM64L-G09RevD.01
frameworkgroup: C1[X(C9H12N4O7)]
method: RPBEPBE
basis: SDD
operation: Freq
keyword: #p
keyword: freq=noraman
keyword: PBEPBE/SDD
title: #p freq=noraman PBEPBE/SDD
converged: YES YES NO NO
title: Mulliken charges:
elementType: O O O O O O O N N N N C C C C C C C C C H H H H H H H H H H H H
charge: -0.235516 -0.364147 -0.434042 -0.431400 -0.261430 -0.430924 -0.415343 -0.232378 -0.212440 -0.183636 -0.229796 0.351057 0.128683 0.180442 0.250550 0.240157 -0.369581 -0.314907 -0.376544 -0.294052 0.299362 0.263469 0.260177 0.224242 0.303271 0.270019 0.235611 0.270187 0.368750 0.385448 0.373053 0.381657
chargesum: 0.00000
title: Mulliken charges with hydrogens summed into heavy atoms:
elementType: O O O O O O O N N N N C C C C C C C C C
charge: -0.235516 -0.364147 -0.065292 -0.045952 -0.261430 -0.057871 -0.033686 -0.232378 -0.212440 -0.183636 -0.229796 0.351057 0.128683 0.180442 0.250550 0.240157 0.193250 0.169512 0.196746 0.211747
polarizability: 1.98550533e+02 -4.68426498e+00 1.80858181e+02 -1.18590050e+00 -4.09509795e-01 8.79812790e+01
1716.lowfreq: -9.2882 -7.6238 -0.0006 -0.0004 0.0001 1.9268 44.8453 62.4792 66.7971
frequency: 44.8155 62.4668 66.7890 79.5409 105.0292 109.0500 122.6264 129.2875 137.5526 176.3627 183.8651 212.0510 227.4962 264.2140 294.7683 305.6890 309.5323 335.7424 362.7475 380.4332 388.7275 392.7211 402.8457 410.9694 427.9209 500.9532 539.9064 563.3500 592.0163 596.3805 632.2104 652.1816 693.7097 701.2245 710.3130 728.0423 752.8847 761.4962 814.1723 861.7542 917.5671 939.4774 950.2399 963.7370 982.2446 1009.0292 1012.9455 1016.4455 1037.0442 1079.7289 1099.4238 1111.3361 1150.2991 1190.1910 1230.0123 1254.4544 1278.6140 1288.6548 1302.7835 1319.6373 1343.9777 1353.2185 1359.3623 1368.9030 1398.7215 1404.4295 1421.7152 1426.4498 1443.9978 1464.2553 1471.0085 1473.5354 1487.2543 1512.5384 1573.1260 1623.7581 1632.4211 1690.7254 2982.6964 3016.7933 3037.2903 3056.3839 3113.2584 3120.8449 3127.5116 3150.2589 3306.4446 3495.4542 3571.1372 3573.6900
redmass: 5.2684 7.3864 7.9657 8.2219 6.0301 5.6260 6.9822 5.3486 5.4017 8.3600 4.9198 6.8700 4.0811 3.2507 3.4129 2.9763 3.8089 4.8388 3.4755 6.6910 3.8555 1.3971 3.0483 5.7507 1.8574 9.3228 4.0550 8.1098 2.2946 2.4197 6.7937 4.4753 5.8822 8.5683 9.5184 5.4383 2.1577 2.1183 5.9327 7.2931 3.3175 2.5132 5.4216 4.5210 3.4529 3.3884 5.4907 2.3025 1.6859 2.2263 2.0337 3.6958 2.5305 2.6660 4.7290 1.4612 1.8175 1.8218 1.8968 2.9873 1.5345 1.1960 1.1875 1.4052 1.2013 1.2559 1.1769 1.1816 2.1459 1.1000 1.1242 1.2197 1.1098 4.2927 7.4214 10.1479 9.5399 11.0366 1.0675 1.0668 1.0606 1.0578 1.0978 1.1079 1.1126 1.0996 1.0668 1.0648 1.0667 1.0666
irintensity: 1.0555 2.9554 1.3396 0.5853 4.6116 12.1330 4.0957 2.7890 5.1581 1.9975 1.6414 4.9202 1.8201 3.9113 17.8061 8.9344 8.2609 13.2020 65.9053 14.5045 43.2681 155.9922 20.0766 30.5059 102.8618 5.6886 3.0491 2.7033 98.7320 201.2162 57.5634 31.7950 9.4024 4.4846 18.2966 36.6414 271.5063 92.9062 20.7905 224.2525 56.0850 68.7474 165.3758 67.4952 183.5079 29.9579 192.3781 3.9652 9.2741 30.2114 48.9390 6.1196 16.8113 13.2470 180.4318 70.6078 123.0569 62.4938 46.3397 138.7199 64.2867 13.6335 21.1151 25.8043 7.1920 92.5713 56.3327 21.9430 3.9404 27.3884 4.1702 9.6957 71.5708 305.3421 34.4887 657.5781 430.4511 442.2622 56.9908 39.3240 14.3894 10.0133 5.2904 2.1580 6.8369 1.2743 179.7880 23.5471 21.0833 16.4404
temp: 298.150 k
press: 1.00000 atm
elementType: 8 8 8 8 8 8 8 7 7 7 7 6 6 6 6 6 6 6 6 6 1 1 1 1 1 1 1 1 1 1 1 1
symmnumber: 1
zpe: 617086.9 jmol-1
zpe.correction: 0.235036 hartree
zpe.thermalcorrener: 0.253736 hartree
zpe.thermalcorrenthalpy: 0.254681 hartree
zpe.thermalcorrgfe: 0.188476 hartree
zpe.sumelectzpe: -1094.245537 hartree
zpe.sumelectthermal: -1094.226836 hartree
zpe.sumelectthermalent: -1094.225892 hartree
zpe.sumelectthermalfe: -1094.292096 hartree
dipole: -1.7206 -2.4586 -2.4572
dipole: 3.8785
quadrupole: -126.8781 -131.0363 -112.5900
quadrupole: 5.7020 -9.5982 -0.2064
quadrupole: -3.3766 -7.5349 10.9115 5.7020 -9.5982 -0.2064
hfenergy: -1094.4805726 hartree
pointgroup: C01 [X(C9H12N4O7)]
dipole: 0.1067041 -1.1573151 0.9887728 debye
polarizability: 198.3819099|-4.9622824|181.0163789|1.5060851|-0.7406956|87.9917039 unknown
InChI: InChI=1S/C9H12N4O7/c14-1-10-5-6(11(2-15)8(10)19)12(3-16)9(20)13(4-17)7(5)18/h14-17H,1-4H2
charge 0 multiplicity 1
32 atoms
O  3.724333 0.626931 0.262663
O  -1.438182 2.550084 0.127278
O  2.596645 -2.65782 -1.277318
O  1.006065 3.612815 -0.616525
O  -2.910916 -1.912187 0.034244
O  0.003314 -3.639822 1.017473
O  -3.800712 1.643802 -1.0857
N  1.806132 -0.8273 0.125046
N  1.448697 1.406368 0.296429
N  -0.598018 -1.532246 -0.057785
N  -2.146268 0.311006 0.108333
C  0.432526 -0.618639 0.0932
C  0.197908 0.75578 0.208418
C  2.479391 0.463335 0.227489
C  -1.119035 1.301545 0.146528
C  -1.957698 -1.085377 0.030011
C  2.591599 -2.068327 0.055233
C  1.648079 2.875331 0.431759
C  -0.373125 -2.993094 -0.227004
C  -3.553718 0.845439 0.083503
H  2.146424 -2.829518 0.712193
H  3.606439 -1.791236 0.391707
H  2.732313 3.045712 0.355278
H  1.277166 3.174427 1.433111
H  0.469385 -3.142293 -0.917903
H  -1.30975 -3.398605 -0.640904
H  -3.693933 1.422296 1.016955
H  -4.224043 -0.022006 0.039066
H  3.209343 -2.156677 -1.872407
H  0.014139 3.561122 -0.459438
H  -0.801899 -3.820592 1.564623
H  -3.275703 2.484045 -0.986454
