program: Gaussian 09
title: 000014414
version: EM64L-G09RevD.01
frameworkgroup: C1[X(C18H25N3O3)]
method: RPBEPBE
basis: SDD
operation: Freq
keyword: #p
keyword: freq=noraman
keyword: PBEPBE/SDD
title: #p freq=noraman PBEPBE/SDD
converged: YES YES NO NO
title: Mulliken charges:
elementType: O O O N N N C C C C C C C C C C C C C C C C C C H H H H H H H H H H H H H H H H H H H H H H H H H
charge: -0.213804 -0.225883 -0.230288 -0.173842 -0.373828 -0.102223 -0.014519 -0.384150 0.115085 0.407917 0.115869 -0.361077 -0.375331 0.191505 -0.719655 -0.380331 -0.371340 -0.331143 -0.332373 -0.241905 -0.238637 -0.672091 -0.672415 -0.239595 0.238797 0.235567 0.262145 0.241001 0.224323 0.232662 0.362790 0.224074 0.232907 0.232904 0.280149 0.253958 0.190094 0.205954 0.192323 0.225603 0.230762 0.230024 0.205475 0.226770 0.221612 0.208367 0.225107 0.207546 0.233140
chargesum: 0.00000
title: Mulliken charges with hydrogens summed into heavy atoms:
elementType: O O O N N N C C C C C C C C C C C C C C C C C C
charge: -0.213804 -0.225883 -0.230288 -0.173842 -0.011037 -0.102223 -0.014519 0.090214 0.115085 0.407917 0.115869 0.142069 0.081654 0.191505 -0.029771 -0.100182 -0.117382 0.064905 0.085553 -0.011143 -0.008613 -0.018234 -0.031395 -0.006455
polarizability: 2.67993443e+02 -1.78768911e+00 2.14592104e+02 1.38884832e+00 -2.43413535e+00 1.84639353e+02
1716.lowfreq: -3.0022 -0.0005 -0.0004 0.0005 6.1796 8.2867 18.6224 25.9946 31.8230
frequency: 18.4912 25.6446 31.6908 35.5433 40.9447 64.7964 79.4758 91.1221 96.1467 109.7346 115.5283 150.4937 157.3914 166.6674 180.7743 209.9516 212.1677 223.4475 239.5305 279.9140 290.9040 295.5813 302.8817 315.4622 336.9605 346.8521 376.9206 401.1355 403.0989 406.3909 436.0350 447.4197 469.1193 507.7037 522.4132 541.7905 604.9889 614.4771 654.5872 672.3696 690.4752 703.1012 704.6960 712.2651 744.0715 760.0558 762.4510 772.9609 783.0683 796.3164 805.4295 852.9060 857.8431 910.4871 917.3811 929.0771 956.2898 976.4978 985.6263 990.1281 991.5050 1002.7593 1031.6716 1037.4813 1052.5926 1076.4919 1078.6557 1080.6283 1086.3148 1092.2116 1093.1333 1125.4180 1134.5339 1146.0016 1155.3033 1175.8532 1180.5503 1208.0089 1211.1770 1217.1415 1268.4716 1283.6183 1291.0905 1296.6148 1303.6177 1322.6656 1328.6169 1331.7259 1341.7852 1358.8200 1362.7375 1373.0456 1376.9537 1379.8446 1387.5447 1390.0728 1390.7096 1391.2306 1436.0684 1439.9146 1447.1502 1462.6902 1464.2620 1473.4940 1480.4957 1481.2381 1482.8549 1486.8659 1487.2132 1488.7184 1492.2144 1581.0410 1589.8643 1605.7617 1638.8104 1653.5784 2857.6318 2867.0449 2901.8470 2982.5240 2983.2717 2986.9799 3023.5036 3026.0720 3032.2099 3052.5376 3058.8719 3074.4160 3074.8013 3076.2506 3082.0409 3091.1087 3091.4361 3099.8597 3127.6678 3129.9068 3135.7549 3147.5858 3156.5656 3168.2901 3518.3099
redmass: 3.9606 4.5657 3.8086 4.1595 7.2814 3.3227 2.6335 2.3689 3.5982 2.8195 2.7571 7.6378 2.9598 2.5989 5.8166 1.4612 1.3705 2.8609 1.8289 2.4098 1.9791 2.1177 2.7209 3.2901 4.8036 3.5270 5.8252 3.0090 3.3400 6.4058 4.1280 3.5428 3.2504 4.0545 4.5906 5.2870 7.1199 6.3158 3.1670 2.9897 5.4991 2.8273 3.3362 5.1473 2.2323 1.3706 1.6846 1.7976 1.3889 1.1333 1.3302 2.7769 1.3850 2.8959 2.5104 1.5438 2.1214 2.1218 1.4731 4.4151 2.2940 1.3170 2.4923 2.9703 2.8575 2.4371 2.0983 2.5937 2.0094 1.6568 2.1793 3.3651 2.0569 2.7727 3.2246 1.2793 1.9778 1.1389 2.2517 2.8549 1.4950 1.3417 1.2695 1.2759 1.5202 1.5877 1.3238 1.3551 1.7468 2.3797 1.3776 1.4006 6.3265 1.9310 1.4909 1.2728 1.2138 1.2676 2.1985 1.1216 1.0893 1.0527 1.0545 1.0526 1.0498 1.9750 1.0669 1.0503 1.0642 1.0756 1.0786 10.8811 5.9682 5.8012 6.3185 7.9586 1.0719 1.0713 1.0704 1.0358 1.0358 1.0356 1.0884 1.0603 1.0879 1.0846 1.0640 1.1008 1.0987 1.0981 1.0980 1.1003 1.1003 1.1035 1.0849 1.1069 1.0881 1.0928 1.0953 1.1012 1.0768
irintensity: 0.1916 0.2026 0.1722 0.0647 0.2617 0.1485 0.1455 0.3597 0.5277 0.4135 0.8530 2.7564 8.3745 3.0065 2.7221 0.6905 0.7441 0.3123 0.9628 1.2437 1.7255 1.3926 1.3879 3.7413 15.5322 1.5451 15.6211 0.5123 8.1603 4.9817 4.3971 13.8797 7.1330 14.3802 19.8973 31.0533 1.4517 0.4432 19.8565 10.4324 4.1073 29.8084 8.3766 15.1548 6.2006 2.1850 53.5647 102.3613 10.4354 4.3443 4.6655 7.9887 0.1724 8.9770 3.8308 3.6835 3.6442 6.1380 0.0687 2.0239 3.1848 0.0663 16.2113 5.8462 4.1681 20.9035 41.2101 16.3893 3.6051 12.4418 28.7162 16.8906 1.3041 5.7133 5.6701 15.5816 37.2336 10.9510 28.6560 26.1664 31.9532 70.3811 5.1588 25.8930 96.4483 71.0155 6.9122 9.1425 139.7654 124.8620 20.9737 33.5580 0.4416 12.6001 102.2974 9.6841 15.9715 22.8322 18.1205 25.3927 32.6357 3.9585 3.8219 0.9365 3.6185 36.8896 8.9988 7.2959 22.0288 11.9509 10.9604 268.2257 6.6032 11.5915 337.1099 215.6458 46.2024 141.9143 84.4059 31.8727 29.3028 27.3807 10.7462 13.2031 21.4136 9.1486 13.0735 3.3800 28.0111 85.3788 35.3769 25.8880 56.6727 20.0530 0.3191 1.6005 6.5254 7.3554 19.9641 22.8772 65.5055
temp: 298.150 k
press: 1.00000 atm
elementType: 8 8 8 7 7 7 6 6 6 6 6 6 6 6 6 6 6 6 6 6 6 6 6 6 1 1 1 1 1 1 1 1 1 1 1 1 1 1 1 1 1 1 1 1 1 1 1 1 1
symmnumber: 1
zpe: 1066967.3 jmol-1
zpe.correction: 0.406386 hartree
zpe.thermalcorrener: 0.431024 hartree
zpe.thermalcorrenthalpy: 0.431968 hartree
zpe.thermalcorrgfe: 0.349958 hartree
zpe.sumelectzpe: -1089.059153 hartree
zpe.sumelectthermal: -1089.034515 hartree
zpe.sumelectthermalent: -1089.033571 hartree
zpe.sumelectthermalfe: -1089.115581 hartree
dipole: 0.2452 0.9915 0.4037
dipole: 1.0982
quadrupole: -133.5764 -143.1500 -150.1925
quadrupole: -6.3721 8.5511 -5.0461
quadrupole: 8.7299 -0.8437 -7.8862 -6.3721 8.5511 -5.0461
hfenergy: -1089.4655392 hartree
pointgroup: C01 [X(C18H25N3O3)]
dipole: 0.0904985 -0.3777051 -0.1892929 debye
polarizability: 268.0567143|0.9029256|214.7365862|-0.7731108|0.0351353|184.4315997 unknown
InChI: InChI=1S/C18H25N3O3/c1-4-18(14-10-8-7-9-11-14)15(22)19-17(24)21(16(18)23)13-12-20(5-2)6-3/h7-11,19H,4-6,12-13H2,1-3H3
charge 0 multiplicity 1
49 atoms
O  0.193428 -0.752361 -1.605427
O  -2.750431 2.733699 -0.16411
O  1.013807 1.656059 2.302142
N  0.571575 0.356054 0.395612
N  -0.908585 2.099133 1.072541
N  4.267172 -0.381732 -0.129307
C  -1.678002 0.585678 -0.754875
C  -2.126123 0.801958 -2.236644
C  -0.237117 0.03465 -0.719851
C  -2.630352 -0.465257 -0.084367
C  -1.830692 1.898045 0.036181
C  1.885289 -0.33558 0.54405
C  3.036009 0.436575 -0.146618
C  0.268856 1.371313 1.329764
C  -1.285712 1.836462 -3.012578
C  -3.959213 -0.08437 0.24007
C  -2.227361 -1.805662 0.140398
C  5.506361 0.396269 0.133053
C  4.366878 -1.297557 -1.299343
C  -4.860019 -1.023712 0.785647
C  -3.132657 -2.742153 0.689274
C  5.630534 0.841836 1.602484
C  5.180372 -2.570882 -0.999178
C  -4.451262 -2.357119 1.016046
H  -2.075264 -0.180698 -2.736915
H  -3.183428 1.118214 -2.213612
H  2.100637 -0.433893 1.618716
H  1.77815 -1.334189 0.092579
H  2.726433 0.708084 -1.183345
H  3.209615 1.377284 0.404619
H  -1.068749 2.900499 1.691788
H  -1.667632 1.929995 -4.044906
H  -0.226713 1.529526 -3.079594
H  -1.343017 2.837028 -2.547576
H  -4.289598 0.94616 0.069968
H  -1.220097 -2.138314 -0.128341
H  5.581141 1.286637 -0.541423
H  6.366179 -0.253492 -0.112079
H  4.800842 -0.771866 -2.186994
H  3.339647 -1.590409 -1.587402
H  -5.881227 -0.711476 1.030719
H  -2.804229 -3.774093 0.855718
H  6.565558 1.412738 1.755701
H  5.639785 -0.039517 2.267076
H  4.789023 1.488639 1.911069
H  5.206046 -3.230154 -1.887025
H  4.724991 -3.123732 -0.159182
H  6.225485 -2.338448 -0.725237
H  -5.150632 -3.084967 1.44171
