program: Gaussian 09
title: 000116994
version: EM64L-G09RevD.01
frameworkgroup: C1[X(C11H11ClO)]
method: RPBEPBE
basis: SDD
operation: Freq
keyword: #p
keyword: freq=noraman
keyword: PBEPBE/SDD
title: #p freq=noraman PBEPBE/SDD
converged: YES YES NO NO
title: Mulliken charges:
elementType: Cl O C C C C C C C C C C C H H H H H H H H H H H
charge: -0.129253 -0.116748 -0.534762 -0.452454 -0.510373 0.132740 0.140625 0.336969 0.295671 -0.438461 -0.331865 -0.807718 -0.207593 0.226792 0.233976 0.226148 0.226207 0.243281 0.256346 0.239831 0.263292 0.235515 0.236705 0.235129
chargesum: 0.00000
title: Mulliken charges with hydrogens summed into heavy atoms:
elementType: Cl O C C C C C C C C C C C
charge: -0.129253 -0.116748 -0.073994 -0.000100 -0.010746 0.132740 0.140625 0.336969 0.295671 -0.198630 -0.068573 -0.100369 -0.207593
polarizability: 1.82162215e+02 -7.68591929e-01 1.48852801e+02 -1.18555634e+00 -2.51867553e+00 6.65275179e+01
1716.lowfreq: -9.6862 -5.3036 -0.0022 -0.0021 -0.0014 5.4393 37.0628 82.1047 95.2113
frequency: 37.0393 82.0930 95.2029 134.3397 141.5402 158.5181 229.5496 245.7655 267.4643 283.7947 353.0651 418.4730 489.4083 491.8691 508.2118 551.6910 577.9201 618.2491 644.1172 676.6040 722.6798 756.1996 837.0142 839.8141 875.8003 921.5568 928.4417 975.0257 982.7698 1025.6663 1028.1840 1047.7628 1061.1693 1133.3533 1179.3374 1182.1180 1191.0260 1207.6913 1239.5254 1264.8197 1283.4379 1290.0917 1320.1650 1391.4144 1395.6992 1402.0177 1451.8951 1460.6777 1466.2113 1470.5608 1472.7753 1480.8705 1573.6456 1605.0348 1704.5619 2969.3992 2975.6552 2984.9685 3008.7922 3039.5249 3050.7261 3066.5387 3083.2140 3091.6157 3137.2041 3177.3869
redmass: 9.5514 1.3461 2.1991 2.0384 2.4439 6.1404 5.5162 2.5297 3.7462 4.0577 10.0028 8.7912 3.9295 3.3307 3.2661 4.2364 4.6055 5.6586 4.3625 2.5260 3.1923 6.2383 1.3582 2.0769 1.6927 2.6227 2.8721 1.3384 2.3533 1.5712 2.3057 1.7368 2.1647 1.2372 1.4879 1.4828 2.6762 1.2811 2.5421 2.0278 1.3085 1.8024 1.4807 2.3533 2.5298 2.5104 1.1003 1.0935 1.1000 1.1240 2.9698 1.1023 6.7436 7.5323 12.6927 1.0655 1.0380 1.0687 1.0657 1.0934 1.0965 1.0927 1.1029 1.0987 1.0898 1.0942
irintensity: 0.1133 0.1071 0.8627 0.1818 0.6812 2.3249 7.0127 5.9957 3.2527 4.1303 3.2138 19.2803 5.8940 4.2367 0.1796 1.0761 0.5068 65.3600 9.2809 18.1649 3.6807 153.1251 32.2572 3.8222 6.8371 4.0531 2.7049 1.0104 92.6590 4.7848 0.8778 8.4126 21.3918 1.2587 11.7657 11.2957 22.8132 5.0583 132.9570 1.8140 2.4192 8.7023 1.1819 17.5371 19.2057 19.0509 12.4929 13.2177 9.4005 15.9049 4.7868 11.5192 29.6615 90.6697 282.1752 32.8362 16.9231 13.8720 34.2368 34.8233 12.7869 9.2692 41.6393 19.7664 13.7043 3.5671
temp: 298.150 k
press: 1.00000 atm
elementType: 17 8 6 6 6 6 6 6 6 6 6 6 6 1 1 1 1 1 1 1 1 1 1 1
symmnumber: 1
zpe: 495008.5 jmol-1
zpe.correction: 0.188539 hartree
zpe.thermalcorrener: 0.200631 hartree
zpe.thermalcorrenthalpy: 0.201575 hartree
zpe.thermalcorrgfe: 0.149384 hartree
zpe.sumelectzpe: -960.142212 hartree
zpe.sumelectthermal: -960.130120 hartree
zpe.sumelectthermalent: -960.129176 hartree
zpe.sumelectthermalfe: -960.181367 hartree
dipole: 5.9044 -1.1745 -0.0127
dipole: 6.0201
quadrupole: -88.9199 -78.1495 -83.8697
quadrupole: 2.3795 -0.3700 0.1890
quadrupole: -5.2735 5.4969 -0.2233 2.3795 -0.3700 0.1890
hfenergy: -960.3307509 hartree
pointgroup: C01 [X(C11H11Cl1O1)]
dipole: -2.3672579 -0.0757237 -0.00822 debye
dipolederiv: -0.8473001 0.4050038 0.0263013 0.6032387 -0.6274187 -0.0332189 0.0376861 -0.0336313 -0.1752432 -0.7560259 -0.2246327 -0.018005 -0.1903889 -1.1050017 -0.0676873 -0.0080951 -0.0614393 -0.2265802 0.0117638 0.0867013 0.0204112 0.0100914 -0.0339406 0.0197368 0.0353023 -0.007117 0.1573729 -0.0024025 -0.0279306 -0.0197573 -0.0187076 0.1311625 0.0499172 0.0072107 -0.0305671 0.1542472 0.0747877 -0.1021523 -0.0051706 0.0329592 -0.1447948 0.0000202 0.0243857 -0.0373973 0.1271423 -0.1137377 -0.4975245 0.0045466 -0.369149 -0.1893679 0.0044585 -0.0379187 0.0528184 -0.076764 0.1745707 0.3809666 -0.0033297 -0.2602412 0.2926369 -0.0012306 -0.0133911 0.0545335 -0.0237431 0.5617249 0.1444209 -0.003261 0.1021437 0.1794983 0.000546 0.0097935 -0.0090702 0.0044479 -1.0338227 -0.130232 -0.0054757 -0.0596466 -0.211934 -0.0111475 -0.005451 -0.0168627 -0.0116571 -0.4845812 0.1063928 -0.0011852 0.1365662 0.0814986 0.0034834 0.0030365 -0.0000515 -0.1726847 0.2112857 -0.0428503 0.0025652 0.3551097 -0.0535707 0.0031399 0.013933 0.0019668 -0.0977898 -0.2725749 -0.0800528 -0.0018115 0.0469015 0.0958337 -0.0014287 -0.0243129 -0.0080762 0.0461504 2.2496618 -0.1362073 -0.0068979 -0.3928262 1.6294978 0.1172413 -0.0345364 0.1098123 0.1847681 -0.0966759 -0.0016119 -0.0882221 -0.0273507 0.0419869 -0.0228315 -0.1336113 0.0121478 0.011647 0.0182945 0.0223387 0.0715098 0.0506512 0.0131276 -0.005191 0.1206782 -0.0229526 -0.1016682 0.0441986 0.0710537 0.0189558 0.0776195 -0.1612898 -0.0592788 0.031826 -0.1022269 0.0524578 0.0447295 -0.0056031 -0.0046546 -0.0130597 0.0772461 0.0083484 -0.0333395 0.0901386 -0.1588723 0.0478358 0.0198041 -0.0481999 0.0040637 0.0074104 -0.0406322 -0.0793407 -0.0508196 -0.0754941 -0.0250818 -0.0294962 0.0665029 -0.0141541 0.0517656 0.0318543 0.0742747 0.0543659 0.0317039 0.0539455 -0.0584702 -0.0000369 -0.0569286 -0.1013829 0.0008085 -0.0003521 0.0008836 0.1503191 0.0724969 0.0732738 -0.0009727 0.0506414 0.0530207 0.0014369 -0.000269 -0.0032465 0.1526704 -0.0035882 0.0021786 0.0599736 0.0136411 0.053286 -0.0974487 0.1108074 -0.0559621 -0.0232355 -0.0057908 -0.0063544 -0.0628818 0.0048143 0.0681062 0.0852855 -0.1058196 0.049915 -0.0395576 0.0762862 0.0309839 -0.0009045 -0.0859892 -0.1473761 0.0138185 0.0075033 0.0128384 0.1103629 unknown
polarizability: 181.5223175|-4.6693948|149.5804312|0.1129485|0.377651|66.4397845 unknown
InChI: InChI=1S/C11H11ClO/c1-7-5-6-10(11(12)13)9-4-2-3-8(7)9/h5-6H,2-4H2,1H3
charge 0 multiplicity 1
24 atoms
Cl 3.746224 -1.329703 -0.03792
O  2.865756 1.24385 0.146364
C  -2.292685 1.394881 0.021778
C  -1.357822 2.573594 -0.387902
C  0.081111 2.12274 0.009737
C  -1.363306 0.188434 0.010741
C  -0.009509 0.603862 0.012235
C  -1.721356 -1.182653 0.026839
C  1.035237 -0.369361 0.031983
C  -0.669853 -2.140706 0.02788
C  0.679927 -1.748621 0.029869
C  -3.173976 -1.612217 0.036104
C  2.433681 0.092955 0.065021
H  -3.156681 1.281342 -0.658077
H  -2.706669 1.547345 1.039965
H  -1.64566 3.52837 0.083809
H  -1.405212 2.714728 -1.483449
H  0.358985 2.483349 1.020661
H  0.859575 2.506043 -0.670655
H  -0.918925 -3.207755 0.030045
H  1.47347 -2.500372 0.033621
H  -3.716011 -1.174373 0.895555
H  -3.697303 -1.269441 -0.87714
H  -3.272498 -2.708992 0.092536
