program: Gaussian 09
title: 000116986
version: EM64L-G09RevD.01
frameworkgroup: C1[X(C19H24Cl2N5O2)]
method: RPBEPBE
basis: SDD
operation: Freq
keyword: #p
keyword: freq=noraman
keyword: PBEPBE/SDD
title: #p freq=noraman PBEPBE/SDD
converged: YES YES NO NO
title: Mulliken charges:
elementType: Cl Cl O O N N N N N C C C C C C C C C C C C C C C C C C C H H H H H H H H H H H H H H H H H H H H H H H H
charge: 0.015742 0.001930 -0.188777 -0.189531 -0.106468 -0.161533 -0.046153 -0.107698 0.022187 -0.364571 -0.498071 -0.552865 -0.541739 -0.554653 -0.390242 0.477089 -0.641556 -0.354760 -0.328855 -0.355978 -0.302139 0.131567 0.478001 -0.197673 -0.258004 0.441883 -0.387171 -0.397431 0.273825 0.316226 0.251042 0.269007 0.275488 0.269017 0.266837 0.270100 0.266814 0.274933 0.271711 0.276149 0.266775 0.243483 0.211020 0.251050 0.214859 0.240506 0.246043 0.206061 0.271961 0.285792 0.318947 0.319824
chargesum: 1.00000
title: Mulliken charges with hydrogens summed into heavy atoms:
elementType: Cl Cl O O N N N N N C C C C C C C C C C C C C C C C C C C
charge: 0.015742 0.001930 -0.188777 -0.189531 -0.106468 -0.161533 -0.046153 -0.107698 0.022187 0.225480 0.021978 0.258477 0.270109 0.259982 0.064261 0.477089 0.064859 -0.108717 -0.122794 -0.084017 -0.016347 0.131567 0.478001 -0.197673 -0.258004 0.441883 -0.068224 -0.077607
polarizability: 6.41745806e+02 -5.26120583e+01 2.53465542e+02 2.44809025e+01 3.50567174e+01 1.94002437e+02
1716.lowfreq: -13.6592 -6.4643 -0.0013 -0.0008 0.0016 3.3797 11.1263 13.3297 23.2256
frequency: -1.6230 12.9234 23.1220 25.3724 32.1157 50.6347 55.2659 57.2703 75.2640 88.0461 101.9035 110.9566 125.5978 139.8716 159.5825 167.2687 185.6682 193.3049 203.3071 205.4466 206.9175 226.5909 243.4494 252.3630 267.8909 286.9903 327.9717 339.1789 340.3413 343.9967 348.5533 366.7844 371.3558 411.9785 415.8478 425.3975 432.4969 441.1013 461.0662 477.7866 505.1039 512.4943 519.2726 541.2373 546.9574 570.4111 595.6041 631.5076 673.1959 699.7477 706.6432 729.8302 734.3920 747.5125 753.8501 784.2352 789.5647 796.9910 802.1814 831.8394 854.3076 858.1630 881.0112 894.6770 913.3156 922.3671 928.2884 937.2670 972.9220 978.3857 990.4110 998.3156 1023.5639 1043.5504 1043.8692 1048.1824 1078.6672 1097.4994 1109.6009 1114.5152 1125.6795 1140.3236 1146.3644 1176.6039 1181.3367 1191.4191 1203.1872 1210.1017 1218.2955 1245.8769 1252.3109 1260.9638 1285.1417 1309.8604 1320.9913 1330.2107 1342.5422 1349.5791 1366.4117 1373.1887 1375.9485 1380.4328 1389.9487 1397.0470 1399.4728 1408.4080 1421.6034 1423.4186 1441.4861 1447.3961 1453.1877 1461.4797 1464.1429 1468.1247 1468.9311 1478.9921 1484.0293 1487.0851 1490.2071 1496.0027 1500.6541 1514.5707 1557.7644 1560.0882 1580.5611 1617.6117 2990.2146 2992.5384 3003.4975 3023.4680 3026.7814 3028.6435 3031.2649 3052.6669 3064.2608 3089.8003 3102.1198 3105.4801 3132.1093 3140.3561 3141.4350 3145.1852 3146.8244 3150.4845 3154.1437 3160.0283 3161.9873 3181.9073 3188.1258 3192.0181
redmass: 5.2538 6.5926 6.4221 4.7709 3.8617 4.6669 3.4682 15.5935 3.1790 3.7353 4.8586 3.2319 6.5105 5.5871 15.6921 1.8353 2.4733 4.5540 2.8289 5.6336 2.5832 1.9488 1.9287 1.4058 1.0952 3.3829 6.6742 9.3263 2.3386 4.7882 4.3744 5.7239 4.5234 5.5277 3.9109 3.4111 2.5766 3.0211 2.7995 3.3157 3.6178 5.1532 5.0108 4.1149 3.3007 3.7488 5.4093 7.0250 6.9705 7.6503 5.5896 4.3768 3.8965 5.3248 10.3002 1.2003 3.1500 1.6097 1.3216 1.6287 3.3551 8.3109 8.5526 2.5290 1.3549 1.4812 2.6487 2.8141 1.3681 1.3735 2.7446 2.7593 3.0748 2.6155 1.2040 1.4631 1.9419 1.5104 1.4441 3.2604 1.5007 2.2393 1.6754 1.5175 1.7619 1.9186 6.7345 1.9918 1.8137 1.8751 2.7834 1.6436 1.3418 1.3832 1.2280 1.2933 1.3496 4.8814 3.0134 2.3795 4.8932 4.6199 1.6994 1.2341 5.2880 4.1838 1.1441 1.1497 1.4083 2.1379 1.0495 1.0967 1.0553 1.0796 1.0441 1.0544 1.0571 1.0570 1.0863 1.3456 1.5605 1.1946 9.5551 6.8361 8.1162 6.4634 1.0625 1.0373 1.0625 1.0329 1.0332 1.0492 1.0407 1.1014 1.0995 1.1003 1.1009 1.1084 1.0864 1.1058 1.1053 1.1050 1.1052 1.1058 1.1051 1.0889 1.0950 1.0958 1.0929 1.0936
irintensity: 3.2914 1.9678 2.4795 0.1064 0.8815 0.7823 0.6015 0.0072 0.4378 1.2683 0.0844 0.9385 2.4475 2.9165 2.4087 0.7684 1.3221 1.7420 0.3659 0.7008 1.4769 0.5636 1.3004 1.2409 0.1374 1.4025 2.7873 1.0742 0.2618 1.7073 2.4091 10.4816 8.1010 1.4038 3.8878 0.4716 5.1188 13.6116 0.3493 0.5308 20.2912 6.7559 3.5781 0.6369 5.3375 15.1501 2.3332 0.5738 6.2331 11.7807 41.7193 8.8968 1.5609 10.0547 62.2071 5.1906 9.7461 24.8909 7.9532 71.4198 100.0483 3.5870 152.7865 2.9542 1.6587 42.9883 7.7508 19.7878 4.0543 0.3092 0.2185 52.8207 2.6257 61.9570 0.5795 6.9783 47.5152 21.5369 3.6100 0.4431 11.0955 422.6503 118.8295 64.2840 25.7246 132.4816 589.8040 22.2470 4.2208 2.0842 3.0802 123.6110 9.4283 11.5939 31.1994 52.5382 139.1595 1.6204 328.9153 19.4058 0.8611 83.4569 24.8909 31.1302 136.8037 43.7005 14.3941 17.3330 0.4859 0.3642 0.5447 4.3158 2.3084 25.0097 10.1139 1.6836 36.5817 56.0956 19.1344 170.2650 61.0030 73.3826 37.3950 71.6688 26.2432 471.0469 45.6275 24.9963 61.6362 1.8587 2.3687 7.0761 2.0365 4.4490 12.3452 29.3695 34.4243 5.2004 61.0764 0.1349 0.7289 2.3995 10.8682 3.5631 6.0285 2.7445 14.9274 17.8172 12.1209 15.6591
temp: 298.150 k
press: 1.00000 atm
elementType: 17 17 8 8 7 7 7 7 7 6 6 6 6 6 6 6 6 6 6 6 6 6 6 6 6 6 6 6 1 1 1 1 1 1 1 1 1 1 1 1 1 1 1 1 1 1 1 1 1 1 1 1
symmnumber: 1
zpe: 1075244.0 jmol-1
zpe.correction: 0.409539 hartree
zpe.thermalcorrener: 0.437566 hartree
zpe.thermalcorrenthalpy: 0.438510 hartree
zpe.thermalcorrgfe: 0.348140 hartree
zpe.sumelectzpe: -2080.263384 hartree
zpe.sumelectthermal: -2080.235357 hartree
zpe.sumelectthermalent: -2080.234413 hartree
zpe.sumelectthermalfe: -2080.324783 hartree
dipole: -35.5453 -6.5340 3.0832
dipole: 36.2721
quadrupole: -20.2443 -139.1939 -169.4355
quadrupole: 49.2848 -22.8915 -11.1180
quadrupole: 89.3802 -29.5693 -59.8109 49.2848 -22.8915 -11.1180
hfenergy: -2080.6729229 hartree
pointgroup: C01 [X(C19H24Cl2N5O2)]
dipole: -14.0837236 2.1286791 -0.8754523 debye
polarizability: 636.379854|72.8514659|245.7402419|-13.6677145|42.8274077|207.0936896 unknown
InChI: InChI=1S/C19H24Cl2N5O2/c1-5-24(10-11-26(2,3)4)15-8-6-14(7-9-15)22-23-19-17(20)12-16(25(27)28)13-18(19)21/h6-9,12-13H,5,10-11H2,1-4H3
charge 1 multiplicity 1
52 atoms
Cl 3.240768 -1.365686 -2.179795
Cl 2.8918 1.705421 2.518405
O  8.026971 0.569095 -1.126779
O  7.902092 1.853031 0.759746
N  -6.129756 1.996666 -0.57145
N  -4.463622 -1.416815 0.190106
N  1.220299 -1.072598 0.058543
N  1.764128 0.087594 0.31838
N  7.381454 1.085648 -0.136925
C  -5.430374 0.619804 -0.745069
C  -5.297971 -0.26139 0.530272
C  -5.289859 2.920512 0.31058
C  -6.270326 2.633261 -1.957136
C  -7.518246 1.823426 0.040606
C  -5.150197 -2.721002 -0.010989
C  -3.05703 -1.310471 0.186346
C  -5.186196 -3.599899 1.25773
C  -2.232518 -2.4332 -0.137464
C  -2.403674 -0.069423 0.497934
C  -0.836308 -2.30967 -0.169288
C  -1.009726 0.047499 0.467555
C  -0.203283 -1.072717 0.121361
C  3.170877 0.188339 0.190709
C  3.968085 -0.342078 -0.873023
C  3.841675 1.029848 1.131828
C  5.933212 0.777453 -0.021552
C  5.334757 -0.047893 -0.994106
C  5.206017 1.326252 1.055687
H  -6.008065 0.074622 -1.511632
H  -4.425666 0.833024 -1.14786
H  -4.868027 0.3048 1.377936
H  -6.286603 -0.627976 0.854118
H  -4.295214 3.042926 -0.144293
H  -5.790766 3.898288 0.380958
H  -5.193138 2.485495 1.315377
H  -6.910342 1.993968 -2.583927
H  -6.725208 3.630456 -1.853065
H  -5.27301 2.723419 -2.413637
H  -8.092022 1.107239 -0.56729
H  -7.424084 1.452363 1.071257
H  -8.029226 2.798538 0.04761
H  -4.665388 -3.259966 -0.844036
H  -6.182528 -2.509482 -0.348077
H  -4.168395 -3.830825 1.614841
H  -5.728355 -3.097211 2.07894
H  -5.699828 -4.554388 1.044895
H  -2.674086 -3.407464 -0.3582
H  -2.983285 0.808533 0.802371
H  -0.204066 -3.168184 -0.416758
H  -0.513174 0.990198 0.719388
H  5.937496 -0.444997 -1.814378
H  5.708434 1.956221 1.792946
