program: Gaussian 09
title: 000116925
version: EM64L-G09RevD.01
frameworkgroup: C1[X(C10H14N2O3)]
method: RPBEPBE
basis: SDD
operation: Freq
keyword: #p
keyword: freq=noraman
keyword: PBEPBE/SDD
title: #p freq=noraman PBEPBE/SDD
converged: YES YES NO NO
title: Mulliken charges:
elementType: O O O N N C C C C C C C C C C H H H H H H H H H H H H H H
charge: -0.441488 -0.441344 -0.316223 -0.133492 0.001608 -0.408171 -0.412134 0.196880 -0.292564 -0.299728 0.287540 -0.277386 -0.300448 -0.335046 -0.327120 0.195476 0.270434 0.258868 0.269806 0.183232 0.214928 0.196636 0.197665 0.228079 0.265325 0.369875 0.355808 0.244905 0.248078
chargesum: 0.00000
title: Mulliken charges with hydrogens summed into heavy atoms:
elementType: O O O N N C C C C C C C C C C
charge: -0.071613 -0.085535 -0.316223 -0.133492 0.001608 0.057738 0.116541 0.196880 0.105596 0.094574 0.287540 -0.049307 -0.035123 -0.090141 -0.079042
polarizability: 1.65676258e+02 2.26373227e-01 1.40286750e+02 -3.75670172e+00 -1.13655236e+01 8.54837803e+01
1716.lowfreq: -13.0035 -8.9537 -0.0009 -0.0009 -0.0008 5.5582 27.5965 36.2763 52.3162
frequency: 27.5090 36.1873 52.2654 58.3728 101.9814 125.0085 142.5785 182.1352 201.7702 245.4936 260.6926 271.6330 306.9304 342.3808 362.0761 366.8817 428.4415 445.5806 491.3467 561.6981 649.8818 658.3647 692.3122 707.8176 725.5427 753.8604 804.9795 829.7323 848.8502 871.3015 885.8639 959.3689 964.4988 979.3852 980.1119 992.2878 1009.8929 1033.2948 1054.4562 1059.4247 1076.0547 1085.7546 1149.3028 1159.0622 1206.4406 1208.6677 1217.0776 1223.7247 1281.1398 1290.3462 1296.9729 1323.9482 1338.4143 1343.7287 1349.5292 1398.1032 1413.1270 1417.5828 1431.6730 1448.2400 1464.0057 1467.0060 1479.1132 1489.2505 1534.8935 1559.3926 1580.5650 2926.4020 2947.8620 2993.7134 3008.7063 3014.1435 3048.1360 3080.2125 3105.5418 3134.4119 3141.8006 3163.5003 3174.6735 3312.9892 3583.7969
redmass: 3.9575 4.6601 5.3466 7.0574 4.4336 2.5889 3.2747 3.7691 5.3679 4.9221 3.3159 1.1146 3.4412 4.1827 5.1273 3.0639 4.5057 2.2786 3.7214 3.8548 5.1495 6.8502 1.5379 2.1657 5.0462 2.7557 1.3026 1.9315 1.9086 2.7335 1.2516 3.9443 1.6748 1.6469 2.9527 3.1146 3.2940 2.7139 2.5943 2.3473 1.8407 1.6376 1.7208 2.0629 1.2223 1.1798 1.3473 1.5524 1.2309 1.6242 5.5074 1.5225 1.2539 1.2982 1.2847 1.8319 1.7405 1.7742 1.2448 1.1748 1.6721 1.1696 1.2435 1.0885 5.1176 6.2080 5.6834 1.0699 1.0547 1.0994 1.0716 1.0627 1.0932 1.1032 1.0968 1.0882 1.0902 1.0957 1.0970 1.0663 1.0669
irintensity: 1.5828 4.8235 2.8806 0.0990 9.8496 3.9139 4.0238 7.5690 1.0399 8.3014 5.1588 143.6367 7.7457 10.5060 9.2508 3.6939 20.7718 2.8672 11.5782 11.2166 24.8478 1.5413 55.8113 88.7305 20.6650 11.4170 8.7584 23.5988 25.7074 11.3107 1.5241 1.0434 8.8150 12.0290 84.4566 7.1761 5.4095 71.4627 19.0881 18.0928 32.0540 2.5999 2.0063 4.9246 53.0458 24.6654 4.7324 13.9762 10.4308 64.1966 0.7103 1.7139 17.3859 23.6616 6.6659 12.7228 70.5996 67.0323 185.1154 14.5672 3.6808 5.7277 10.2388 10.9048 142.4411 70.4701 5.8579 68.7540 60.0192 39.2923 41.6252 23.5836 65.8889 22.0243 13.0702 12.0439 14.8336 17.3737 3.5993 281.3475 9.0806
temp: 298.150 k
press: 1.00000 atm
elementType: 8 8 8 7 7 6 6 6 6 6 6 6 6 6 6 1 1 1 1 1 1 1 1 1 1 1 1 1 1
symmnumber: 1
zpe: 612136.3 jmol-1
zpe.correction: 0.233150 hartree
zpe.thermalcorrener: 0.248101 hartree
zpe.thermalcorrenthalpy: 0.249045 hartree
zpe.thermalcorrgfe: 0.189246 hartree
zpe.sumelectzpe: -723.467810 hartree
zpe.sumelectthermal: -723.452860 hartree
zpe.sumelectthermalent: -723.451915 hartree
zpe.sumelectthermalfe: -723.511714 hartree
dipole: 0.7748 5.8111 -0.8850
dipole: 5.9289
quadrupole: -105.3634 -88.6210 -89.1500
quadrupole: 15.8165 -0.5502 -11.9756
quadrupole: -10.9853 5.7571 5.2282 15.8165 -0.5502 -11.9756
hfenergy: -723.7009602 hartree
pointgroup: C01 [X(C10H14N2O3)]
dipole: 0.1007921 2.2394 -0.6450062 debye
polarizability: 165.1546288|1.1586993|136.613545|-5.8879778|-18.2970212|89.6786142 unknown
InChI: InChI=1S/C10H14N2O3/c13-7-5-12(6-8-14)10(15)9-1-3-11-4-2-9/h1-4,13-14H,5-8H2
charge 0 multiplicity 1
29 atoms
O  3.579089 -2.147193 0.244759
O  0.618101 3.965416 0.089821
O  0.934648 -1.986091 -0.355053
N  1.303027 0.302032 -0.173698
N  -3.848604 -0.589852 0.414056
C  2.745464 0.095681 -0.508027
C  0.940729 1.626572 0.380702
C  0.470507 -0.804171 -0.173188
C  3.559555 -0.7225 0.533686
C  0.926518 2.750343 -0.672022
C  -1.014157 -0.647434 0.04489
C  -1.815893 0.325637 -0.602054
C  -1.665667 -1.606313 0.860976
C  -3.21365 0.310756 -0.392819
C  -3.065558 -1.531045 1.024781
H  3.183989 1.102638 -0.618574
H  2.820224 -0.422814 -1.481712
H  1.675087 1.900496 1.162615
H  -0.046185 1.577899 0.865045
H  3.166008 -0.507222 1.553448
H  4.61516 -0.398488 0.499369
H  0.157986 2.54944 -1.447448
H  1.913449 2.831224 -1.175166
H  -1.37929 1.064641 -1.280349
H  -1.084079 -2.398741 1.340512
H  2.63853 -2.398353 -0.002819
H  0.609371 4.750394 -0.512169
H  -3.859564 1.043819 -0.888705
H  -3.594194 -2.249668 1.660342
