program: Gaussian 09
title: 000116900
version: EM64L-G09RevD.01
frameworkgroup: C1[X(C8H4Cl3N)]
method: RPBEPBE
basis: SDD
operation: Freq
keyword: #p
keyword: freq=noraman
keyword: PBEPBE/SDD
title: #p freq=noraman PBEPBE/SDD
converged: NO NO NO NO
title: Mulliken charges:
elementType: Cl Cl Cl N C C C C C C C C H H H H
charge: -0.018494 -0.018561 -0.016935 0.001307 0.651074 -0.267483 -0.267569 -0.576098 -0.216166 -0.216135 -0.089930 -0.105741 0.280615 0.280737 0.289687 0.289691
chargesum: 0.00000
title: Mulliken charges with hydrogens summed into heavy atoms:
elementType: Cl Cl Cl N C C C C C C C C
charge: -0.018494 -0.018561 -0.016935 0.001307 0.651074 -0.267483 -0.267569 -0.014745 0.073522 0.073556 -0.089930 -0.105741
polarizability: 1.54029890e+02 -5.81665154e-03 1.29894221e+02 2.28442693e+00 9.30491206e-03 6.26771299e+01
1716.lowfreq: -7.9500 0.0022 0.0024 0.0031 6.2852 6.6123 19.4021 52.1709 111.3835
frequency: 19.3705 52.1699 111.3832 150.0457 176.2329 196.5889 196.9563 280.7604 323.7142 340.5229 345.3858 360.3955 409.7952 490.2873 498.0620 517.4271 561.3946 675.3249 739.4002 747.6359 828.6245 858.9519 866.9164 917.8816 927.8699 1044.9532 1110.8163 1161.9699 1210.4703 1226.2256 1306.8060 1362.8900 1370.5034 1431.2121 1438.4243 1558.3600 1585.3317 2203.6430 3018.3591 3078.6434 3193.0979 3194.6650
redmass: 10.7899 16.1805 14.2447 9.8211 24.0758 4.7090 21.4994 5.0149 8.0177 11.1053 32.8120 2.5194 8.2618 4.3174 9.7820 5.1662 4.4433 5.0396 8.9080 8.6906 6.5791 1.4506 1.3659 1.9180 4.8266 3.3834 2.8694 1.4396 2.8101 1.1832 1.4220 3.4578 6.2922 2.4042 1.2440 8.7770 8.9466 12.4433 1.0588 1.1008 1.0934 1.0943
irintensity: 2.9793 1.6564 1.2639 0.4242 0.4341 0.0063 1.2822 4.9268 2.9152 8.0188 0.0165 1.1480 6.8513 0.7630 10.7294 0.0005 12.2111 14.8467 62.5989 17.0654 48.9854 41.3103 0.0073 22.4327 3.4913 3.5923 8.7944 16.7134 1.3441 1.2315 0.1893 34.4123 12.1892 91.9554 11.3636 93.9121 104.4209 5.8566 2.9200 0.5516 3.8567 1.0860
temp: 298.150 k
press: 1.00000 atm
elementType: 17 17 17 7 6 6 6 6 6 6 6 6 1 1 1 1
symmnumber: 1
zpe: 251750.9 jmol-1
zpe.correction: 0.095887 hartree
zpe.thermalcorrener: 0.107376 hartree
zpe.thermalcorrenthalpy: 0.108320 hartree
zpe.thermalcorrgfe: 0.055911 hartree
zpe.sumelectzpe: -1741.318476 hartree
zpe.sumelectthermal: -1741.306986 hartree
zpe.sumelectthermalent: -1741.306042 hartree
zpe.sumelectthermalfe: -1741.358451 hartree
dipole: 2.1426 0.0006 -3.0922
dipole: 3.7620
quadrupole: -100.0484 -87.5585 -94.6202
quadrupole: -0.0023 11.9927 -0.0006
quadrupole: -5.9727 6.5172 -0.5446 -0.0023 11.9927 -0.0006
hfenergy: -1741.4143624 hartree
pointgroup: C01 [X(C8H4Cl3N1)]
dipole: -0.9421831 -0.0000939 -1.1414399 debye
dipolederiv: -0.2547354 -0.2393851 0.0494072 -0.239164 -0.6131781 0.0722455 0.0606849 0.0695779 -0.056954 -0.2548353 0.2394861 0.0496601 0.2391409 -0.61299 -0.0727311 0.06098 -0.0699613 -0.0570708 -0.7981086 -0.0001579 0.1662963 -0.0001655 -0.121573 0.0000113 0.1884457 0.0000249 -0.0844361 -0.2616675 -0.000481 0.0159276 0.000013 -0.2091332 -0.0002389 -0.0868452 -0.0007412 -0.1872614 0.0480995 0.0001918 0.0158385 0.000193 -0.5186407 -0.0003751 0.026846 -0.000266 -0.074288 0.4277737 0.3444539 -0.1204494 0.2720141 0.9732448 -0.1005423 -0.1198999 -0.0830122 -0.0209823 0.4278076 -0.344549 -0.1208682 -0.2718962 0.9730228 0.1014067 -0.1202998 0.0838384 -0.0208151 0.1637289 -0.0000908 -0.0348675 -0.0007953 0.1443628 -0.0004324 -0.072248 -0.0002192 0.0997151 -0.488102 -0.1681429 0.0968094 -0.1479392 -0.2712455 0.0423522 0.1055987 0.044923 -0.0822907 -0.4882108 0.1680191 0.096932 0.1477582 -0.2711162 -0.0425029 0.1057291 -0.0450657 -0.0823342 1.2355977 0.0002364 -0.3009725 0.0002594 0.3252204 0.0000425 -0.322961 0.0000599 0.022194 -0.049653 0.0004305 0.1125189 0.0002946 -0.0170987 0.0006474 0.1950579 0.0008805 0.0510626 0.0577294 -0.01465 -0.0306535 -0.0673327 0.0545582 0.0812009 -0.0327277 0.0245925 0.0773288 0.0577502 0.0146445 -0.0308496 0.0676224 0.0546916 -0.0810168 -0.0329108 -0.0245397 0.0774338 0.0884063 0.0249792 0.0176463 0.028673 0.0549508 -0.0068249 0.0222796 -0.0075891 0.1693427 0.0884193 -0.0249848 0.0176244 -0.0286756 0.0549239 0.0067578 0.0222705 0.0074974 0.1693557 unknown
polarizability: 153.0024821|0.0057764|129.8942182|-9.9004886|0.0157571|63.7045414 unknown
InChI: InChI=1S/C8H4Cl3N/c9-5-3-7(10)6(1-2-12)8(11)4-5/h3-4H,1H2
charge 0 multiplicity 1
16 atoms
Cl 0.594065 2.801637 -0.466646
Cl 0.594778 -2.8013 -0.468709
Cl -4.034549 -0.000873 0.684597
N  3.556233 0.000425 1.305723
C  0.48225 0.000168 -0.45746
C  -0.250268 1.199138 -0.267844
C  -0.249911 -1.199151 -0.268612
C  1.959003 0.00058 -0.835269
C  -1.61451 1.231035 0.076652
C  -1.614142 -1.231669 0.075874
C  -2.274368 -0.000467 0.241644
C  2.841522 0.002088 0.35093
H  2.193223 0.893618 -1.440703
H  2.194091 -0.892949 -1.439606
H  -2.138285 2.179255 0.211658
H  -2.137632 -2.180136 0.21027
