program: Gaussian 09
title: 000116853
version: EM64L-G09RevD.01
frameworkgroup: C1[X(C10H15NO)]
method: RPBEPBE
basis: SDD
operation: Freq
keyword: #p
keyword: freq=noraman
keyword: PBEPBE/SDD
title: #p freq=noraman PBEPBE/SDD
converged: YES YES NO NO
title: Mulliken charges:
elementType: O N C C C C C C C C C C H H H H H H H H H H H H H H H
charge: -0.291026 -0.036023 0.067079 -0.238161 -0.516104 0.147373 -0.691529 -0.697833 -0.303436 -0.190278 -0.365544 -0.184092 0.179907 0.198149 0.199729 0.220754 0.228268 0.211777 0.224157 0.223460 0.200480 0.231050 0.220613 0.262526 0.234846 0.236091 0.227769
chargesum: 0.00000
title: Mulliken charges with hydrogens summed into heavy atoms:
elementType: O N C C C C C C C C C C
charge: -0.291026 -0.036023 0.246986 0.159716 -0.067082 0.147373 -0.032136 -0.045690 -0.040910 0.044568 -0.129453 0.043676
polarizability: 1.38933209e+02 7.36297910e+00 1.18013650e+02 -1.53634246e+01 4.91961952e+00 8.59933392e+01
1716.lowfreq: -8.1530 0.0005 0.0006 0.0007 4.7612 15.6505 24.4619 37.6212 46.9056
frequency: 23.9276 37.3794 46.7555 113.1473 141.0913 174.9404 191.9756 240.7405 249.4962 315.9244 349.4097 389.0298 405.2604 448.4528 464.0433 515.1671 580.2566 620.5998 751.2784 759.0740 774.4788 793.5718 860.8363 896.5555 917.0507 923.6331 935.8445 952.7373 962.5804 978.7711 998.1583 1017.5063 1042.8086 1062.4857 1091.8438 1118.5332 1145.2100 1163.7618 1172.8767 1188.7319 1220.3807 1237.7138 1296.9109 1309.4069 1326.4625 1330.3353 1338.1571 1369.0693 1381.2410 1390.5075 1414.5371 1445.3875 1455.7597 1458.3734 1465.6350 1471.5291 1482.7373 1488.9330 1563.6120 1583.5646 2922.1478 2932.2836 2980.6860 2985.2297 2989.7263 3012.2428 3077.0133 3078.6097 3084.3335 3091.8090 3096.0259 3122.1626 3136.1652 3160.5044 3174.9005
redmass: 4.0444 2.9389 3.6244 4.3325 2.9457 2.9445 1.0383 1.6739 1.6281 2.6543 2.3379 2.4356 3.4564 3.0034 2.3052 3.6692 3.0057 6.2254 1.6627 2.5804 3.5978 2.3744 2.5446 1.3255 1.2269 2.3030 1.4205 1.5381 4.4205 2.4576 1.3432 2.7477 2.2442 2.5344 1.6442 1.9006 1.8997 1.0883 1.5906 1.4319 1.3117 2.1352 1.9693 1.2448 2.3451 1.4312 1.5693 1.2665 1.3260 1.2316 1.9669 1.1117 1.0683 2.0719 1.0642 1.0487 1.0916 1.0577 5.8145 5.7856 1.0834 1.0558 1.0457 1.0886 1.0355 1.0665 1.0990 1.1012 1.1006 1.0994 1.1001 1.0879 1.0899 1.0966 1.0988
irintensity: 1.2502 1.0801 1.0657 4.2821 4.5094 2.8905 0.2029 0.7519 2.7956 1.3231 0.6600 2.5998 4.7494 1.1928 3.5476 8.9620 9.8652 1.3512 38.9533 16.1319 9.5321 16.2672 5.3089 0.9349 2.4928 9.9932 2.3595 1.3533 0.3420 18.5234 0.4723 57.9160 4.4139 26.2872 8.9620 88.3132 20.8129 0.5691 15.1285 6.7242 10.0177 1.3314 0.9939 45.2510 1.5909 5.1885 3.4701 16.3334 21.2647 26.8053 14.7727 11.3407 12.3072 32.4161 2.7932 5.9171 3.7757 19.1271 11.1446 37.4747 45.7153 63.5926 9.3464 53.7717 19.3074 51.0946 27.5674 13.0179 12.8734 60.7147 40.0054 13.2644 15.4192 34.0506 7.2558
temp: 298.150 k
press: 1.00000 atm
elementType: 8 7 6 6 6 6 6 6 6 6 6 6 1 1 1 1 1 1 1 1 1 1 1 1 1 1 1
symmnumber: 1
zpe: 602260.1 jmol-1
zpe.correction: 0.229389 hartree
zpe.thermalcorrener: 0.241941 hartree
zpe.thermalcorrenthalpy: 0.242886 hartree
zpe.thermalcorrgfe: 0.188872 hartree
zpe.sumelectzpe: -519.096967 hartree
zpe.sumelectthermal: -519.084414 hartree
zpe.sumelectthermalent: -519.083470 hartree
zpe.sumelectthermalfe: -519.137483 hartree
dipole: -1.2358 1.4228 -0.5070
dipole: 1.9516
quadrupole: -66.5996 -70.5419 -73.0113
quadrupole: 6.4811 0.6704 -0.6170
quadrupole: 3.4513 -0.4910 -2.9604 6.4811 0.6704 -0.6170
hfenergy: -519.3263557 hartree
pointgroup: C01[X(C10H15N1O1)]
dipole: -0.4553015 0.2907255 -0.5456195 debye
polarizability: 141.6485379|-0.996368|110.1683396|-11.6665903|-15.4009627|91.1233204 unknown
InChI: InChI=1S/C10H15NO/c1-9(2)12-8-6-10-5-3-4-7-11-10/h3-5,7,9H,6,8H2,1-2H3
charge 0 multiplicity 1
27 atoms
O  -1.821183 0.043087 0.243012
N  2.198068 -1.107608 0.595708
C  -2.775951 -0.169515 -0.869551
C  -1.21335 -1.188312 0.764007
C  -0.005417 -0.785016 1.631716
C  1.156299 -0.242822 0.820203
C  -4.052266 -0.895821 -0.398225
C  -3.065547 1.228215 -1.429808
C  1.151617 1.079151 0.301245
C  2.254729 1.525789 -0.457892
C  3.256288 -0.661326 -0.143606
C  3.334898 0.64095 -0.685632
H  -2.269038 -0.786583 -1.647382
H  -1.945381 -1.74809 1.384189
H  -0.887746 -1.843621 -0.073825
H  -0.353245 -0.035049 2.366289
H  0.346553 -1.676127 2.180676
H  -4.768348 -0.992607 -1.235167
H  -3.832183 -1.912036 -0.02509
H  -4.538346 -0.323482 0.412554
H  -3.744387 1.166212 -2.29935
H  -2.127386 1.715538 -1.746463
H  -3.540645 1.85793 -0.656348
H  0.286095 1.721109 0.486482
H  2.272695 2.542977 -0.864716
H  4.066955 -1.383645 -0.297922
H  4.211725 0.9473 -1.265305
