program: Gaussian 09
title: 000116837
version: EM64L-G09RevD.01
frameworkgroup: C1[X(C17H15N5O10S3)]
method: RPBEPBE
basis: SDD
operation: Freq
keyword: #p
keyword: freq=noraman
keyword: PBEPBE/SDD
title: #p freq=noraman PBEPBE/SDD
converged: YES YES NO NO
title: Mulliken charges:
elementType: S S S O O O O O O O O O O N N N N N C C C C C C C C C C C C C C C C C H H H H H H H H H H H H H H H
charge: 0.984145 0.995600 1.006913 -0.542501 -0.560575 -0.553373 -0.470065 -0.572738 -0.484827 -0.483521 -0.505908 -0.502701 -0.296887 -0.350670 -0.113455 -0.448658 -0.666282 -0.677781 0.565181 0.452188 -0.226434 -0.098378 -0.415879 -0.452126 -0.450807 -0.419312 -0.267389 0.526045 0.011255 0.341965 -0.231069 -0.534283 0.602769 -0.432616 0.247247 0.307480 0.300058 0.297845 0.332708 0.391991 0.390798 0.405901 0.272581 0.319059 0.239702 0.357823 0.332562 0.338759 0.343225 0.394435
chargesum: 0.00000
title: Mulliken charges with hydrogens summed into heavy atoms:
elementType: S S S O O O O O O O O O O N N N N N C C C C C C C C C C C C C C C C C
charge: 0.984145 0.995600 1.006913 -0.150510 -0.169777 -0.147472 -0.470065 -0.572738 -0.484827 -0.483521 -0.505908 -0.502701 -0.296887 -0.350670 -0.113455 -0.090836 0.005038 0.059880 0.565181 0.452188 -0.226434 -0.098378 -0.108399 -0.452126 -0.150750 -0.121466 0.065319 0.526045 0.011255 0.341965 0.041512 -0.215224 0.602769 -0.192914 0.247247
polarizability: 8.19315812e+02 -1.30831965e+00 4.16945316e+02 2.42205526e+00 2.67647609e+00 1.79353020e+02
1716.lowfreq: -3.1322 -1.1044 -0.0020 -0.0015 -0.0008 4.5822 17.8220 21.1669 26.2703
frequency: 17.8184 21.1657 26.2431 34.4793 38.7205 46.9980 54.6613 62.1384 81.5220 91.1072 93.8536 96.0664 101.5719 106.8871 125.7962 133.1915 150.4943 155.7251 158.6293 171.9851 177.6214 188.8781 206.2126 208.0045 209.8467 221.8774 231.2305 242.9168 261.6452 274.8804 281.6606 287.5377 293.7891 307.6644 320.8816 327.4564 329.7239 335.1743 343.8716 353.1507 361.5029 376.4416 408.2073 411.6768 417.2055 425.1468 438.2482 468.1166 476.9521 486.2533 496.5048 520.8565 530.3719 535.5365 540.6804 553.2313 562.2271 570.5826 575.6691 589.0505 604.8836 609.4829 629.8705 644.3194 663.2839 679.0536 709.4276 727.2625 732.4989 750.9987 760.8374 776.4446 804.1281 816.2755 821.0355 832.2356 834.0460 835.6228 843.5145 866.8125 898.0544 911.6908 912.7733 925.3097 930.4620 936.5729 955.0488 957.4751 968.7896 971.3884 973.2001 974.0181 985.0790 1002.2421 1046.5207 1049.8682 1051.7219 1079.5851 1084.9536 1128.6550 1145.8127 1192.3662 1207.3368 1223.2906 1251.1575 1260.2682 1281.4395 1296.7722 1314.1556 1359.6945 1370.3790 1383.9674 1393.2341 1414.5948 1418.7935 1435.1428 1471.5203 1485.7493 1492.0688 1510.1657 1532.2813 1537.8592 1552.0907 1586.0484 1616.7021 1635.4076 1640.3576 1653.1991 1664.6043 2150.9891 3140.7735 3141.9497 3144.1545 3148.9389 3166.4189 3168.5849 3204.4489 3392.1586 3410.8684 3470.9867 3479.7323 3538.2619 3648.6042 3678.1860
redmass: 9.3583 8.0703 9.3943 10.2482 11.0982 10.1445 9.2505 7.1763 11.6615 7.0605 5.8026 6.8183 7.0715 6.9397 7.1787 8.3054 9.3319 8.6612 6.7256 2.5796 2.4819 6.6736 3.4546 3.9749 3.2516 4.8627 5.3505 4.5294 7.6982 5.1880 5.5840 4.9060 7.3751 8.1195 6.3309 11.8380 7.6634 8.7645 9.5120 5.6135 4.9639 6.7894 8.1790 8.2992 6.2863 11.0024 5.8354 2.7552 6.6404 1.2035 2.9992 6.5728 5.3140 1.2250 6.3036 7.4511 1.3067 5.7113 6.2868 8.1170 6.5411 5.0478 7.8538 3.4289 6.3039 8.2611 1.7616 2.9807 3.9221 6.8037 3.2357 6.2930 2.0176 1.6491 6.8928 4.0174 3.1059 2.3575 14.7477 8.1631 1.4063 5.0959 1.4813 1.4607 3.1283 1.7826 3.0268 12.6048 1.3728 2.5966 2.7534 4.8775 2.3330 2.4089 1.5073 1.1675 1.1684 1.9635 1.8473 2.0759 1.8228 2.2535 1.7811 1.6929 1.9702 1.6192 2.9435 2.0296 2.4017 2.3856 3.6092 4.8971 3.7708 3.7154 5.5620 7.3484 1.4623 4.8671 3.7574 3.5609 4.1671 4.6329 7.3221 7.5555 6.9008 1.8084 3.1134 1.2521 2.7050 1.0746 1.0886 1.0927 1.0930 1.0932 1.0955 1.0956 1.0901 1.0632 1.0727 1.0662 1.0662 1.0457 1.0925 1.1041
irintensity: 0.8620 1.6691 1.8853 1.3789 3.0911 0.9666 1.7241 1.8856 0.1795 0.6951 1.3035 1.3650 1.7757 5.2968 1.8841 0.7001 8.5684 0.6742 1.0609 20.6150 44.8844 19.3972 8.1733 2.9581 4.8391 12.6811 12.9599 34.5164 17.9801 56.6226 58.4528 50.8857 20.5090 4.8248 4.8279 19.8866 8.2550 16.0358 1.0258 8.4212 3.0842 13.2634 38.2088 38.6549 18.4399 129.7255 15.0287 26.5092 25.5119 10.6775 45.8867 6.9627 48.4390 76.3603 225.4222 23.8988 248.6004 64.5600 35.2563 55.5965 12.3498 44.8670 37.5561 1.2328 14.9513 31.3182 117.5274 7.0119 9.6905 12.7416 9.0770 3.5133 44.8750 57.8427 29.0805 80.1066 65.2362 153.6801 180.0040 8.3575 5.6934 17.2014 63.4099 32.1198 4.3282 25.5139 32.9574 130.6550 0.3072 32.1367 5.5472 67.3102 102.3551 37.0523 11.7010 15.0861 141.8689 94.1610 35.5341 98.9642 18.7654 27.1952 442.3588 36.9981 70.1147 38.4187 116.5640 207.1697 102.7201 312.6886 1272.2691 423.7991 83.0430 60.2579 56.2751 56.6593 405.9975 32.5337 154.6118 125.1781 9.3625 293.1441 49.2290 12.2874 295.3596 27.5223 362.5261 494.0062 329.0776 1561.5353 7.0572 6.1910 37.7094 11.0875 7.5942 15.4614 3.9129 132.1339 149.0013 55.7397 66.7029 409.1176 122.2830 35.5645
temp: 298.150 k
press: 1.00000 atm
elementType: 16 16 16 8 8 8 8 8 8 8 8 8 8 7 7 7 7 7 6 6 6 6 6 6 6 6 6 6 6 6 6 6 6 6 6 1 1 1 1 1 1 1 1 1 1 1 1 1 1 1
symmnumber: 1
zpe: 848239.1 jmol-1
zpe.correction: 0.323077 hartree
zpe.thermalcorrener: 0.358192 hartree
zpe.thermalcorrenthalpy: 0.359136 hartree
zpe.thermalcorrgfe: 0.254630 hartree
zpe.sumelectzpe: -2873.943550 hartree
zpe.sumelectthermal: -2873.908435 hartree
zpe.sumelectthermalent: -2873.907491 hartree
zpe.sumelectthermalfe: -2874.011997 hartree
dipole: 8.4207 -6.1820 2.2333
dipole: 10.6823
quadrupole: -156.2367 -277.0847 -237.8762
quadrupole: 3.2218 -14.7357 -9.1354
quadrupole: 67.4958 -53.3521 -14.1437 3.2218 -14.7357 -9.1354
hfenergy: -2874.2666274 hartree
pointgroup: C01 [X(C17H15N5O10S3)]
dipole: -3.2731187 2.4427009 0.9915127 debye
polarizability: 819.0221698|-5.3375685|416.9935857|-12.244518|3.5638267|179.5983919 unknown
InChI: InChI=1S/C17H15N5O10S3/c18-9-1-2-12(13(5-9)20-17(19)23)21-22-14-7-11-8(4-16(14)35(30,31)32)3-10(33(24,25)26)6-15(11)34(27,28)29/h1-7,20,24,27,30H,18-19H2
charge 0 multiplicity 1
50 atoms
S  1.776131 2.754958 0.426479
S  6.573769 0.13294 -0.570699
S  -0.142924 -4.376452 0.035694
O  1.533342 2.43222 2.227324
O  6.996987 0.074455 1.233268
O  -1.686565 -4.012012 -0.795972
O  2.803964 3.97699 0.20899
O  0.297771 2.863289 -0.245535
O  7.096408 -1.218131 -1.286523
O  6.953932 1.594269 -1.147832
O  0.756565 -5.375642 -0.856933
O  -0.4101 -4.711722 1.594895
O  -4.653005 3.84878 -0.290292
N  -1.551317 -1.596435 0.046167
N  -2.205515 -0.442488 0.065576
N  -3.223509 1.96929 -0.132873
N  -7.751026 0.11266 -0.042178
N  -2.331741 4.113733 -0.350722
C  1.922948 -0.119501 0.043058
C  2.713912 -1.326002 -0.174022
C  2.65145 1.115839 0.084109
C  4.726648 0.0231 -0.303846
C  4.127017 -1.229719 -0.341202
C  0.664594 -2.641697 -0.063007
C  2.040452 -2.592364 -0.196814
C  0.516262 -0.217769 0.160093
C  4.023815 1.233749 -0.081813
C  -0.138796 -1.458445 0.071675
C  -3.57173 -0.416475 0.0402
C  -4.142678 0.932822 -0.053922
C  -4.455283 -1.549771 0.100041
C  -5.539056 1.100671 -0.079694
C  -6.383582 -0.040081 -0.016535
C  -5.827973 -1.374704 0.076664
C  -3.484245 3.358438 -0.261599
H  4.73105 -2.126983 -0.517041
H  2.609849 -3.51834 -0.337761
H  -0.097403 0.674515 0.27847
H  4.537204 2.202001 -0.063048
H  1.14047 3.253443 2.64693
H  7.990093 0.171091 1.323154
H  -1.882601 -3.005252 -0.445666
H  -4.02875 -2.554286 0.183608
H  -5.94442 2.112745 -0.155605
H  -6.500904 -2.237293 0.133986
H  -2.247614 1.639533 -0.109457
H  -8.372094 -0.693041 -0.00522
H  -8.170508 1.03872 -0.104584
H  -2.456335 5.116955 -0.468174
H  -1.379759 3.724502 -0.351611
