program: Gaussian 09
title: 000116829
version: EM64L-G09RevD.01
frameworkgroup: C1[X(C14H8ClF2N3O4S)]
method: RPBEPBE
basis: SDD
operation: Freq
keyword: #p
keyword: freq=noraman
keyword: PBEPBE/SDD
title: #p freq=noraman PBEPBE/SDD
converged: YES YES NO NO
title: Mulliken charges:
elementType: Cl S F F O O O O N N N C C C C C C C C C C C C C C H H H H H H H H
charge: 0.011934 0.985111 -0.141494 -0.131124 -0.404166 -0.566210 -0.497569 -0.497530 -0.448958 -0.098795 -0.002230 0.463242 0.264423 -0.054662 -0.452309 -0.538743 0.493948 0.168706 -0.321904 -0.389690 -0.535668 0.372071 -0.436571 0.276012 0.032311 0.298425 0.339093 0.195943 0.309591 0.234992 0.325232 0.362502 0.384089
chargesum: 0.00000
title: Mulliken charges with hydrogens summed into heavy atoms:
elementType: Cl S F F O O O O N N N C C C C C C C C C C C C C C
charge: 0.011934 0.985111 -0.141494 -0.131124 -0.041664 -0.182121 -0.497569 -0.497530 -0.123726 -0.098795 -0.002230 0.463242 0.264423 -0.054662 -0.153884 -0.199650 0.493948 0.168706 -0.125961 -0.080099 -0.300676 0.372071 -0.436571 0.276012 0.032311
polarizability: 4.06154617e+02 5.19489278e-01 2.66688334e+02 1.10443093e+00 1.20437667e+00 1.01357678e+02
1716.lowfreq: -1.9722 -0.0014 0.0013 0.0017 2.9707 7.4793 18.9253 24.9164 37.3256
frequency: 18.8882 24.8394 37.3204 45.9145 72.4171 73.5680 99.5929 108.1174 136.8858 145.5990 165.9320 188.1034 203.9106 212.8964 222.8675 229.2816 241.0905 248.7040 261.0638 292.9910 306.6332 319.4238 326.1101 339.7309 342.1097 346.2148 397.5917 413.0125 450.4247 470.2337 501.7732 510.5580 532.7300 535.3441 585.5267 587.7773 591.3603 607.6092 617.0353 634.5326 652.0701 666.7838 691.3718 708.8505 734.4591 749.0081 762.5960 775.6189 813.5721 829.3972 861.1711 880.2316 888.6173 936.8973 940.8261 964.7977 966.2740 972.0537 1014.7792 1047.7813 1050.9996 1056.4394 1084.4488 1133.1563 1182.4467 1195.2677 1241.3612 1257.4322 1264.2464 1290.7555 1327.1994 1351.0617 1375.0423 1395.8722 1424.8897 1433.8671 1441.0481 1464.8553 1488.4465 1516.0260 1553.3689 1584.1462 1600.5158 1606.6178 1638.9572 3102.4072 3131.9534 3161.8832 3181.0367 3190.5441 3480.9273 3489.6321 3594.1639
redmass: 14.8836 9.3888 8.1189 13.3209 7.9051 6.7867 11.3274 4.3502 6.0861 11.2320 1.6194 6.7557 5.2644 9.4341 6.4130 6.7551 11.3858 1.6971 3.6746 4.3659 7.1294 10.2049 10.3748 7.0051 7.2248 9.1208 12.3926 10.6666 2.8287 7.4746 8.2674 12.2308 8.2248 5.5884 8.3479 4.7663 5.8079 8.2154 4.5500 14.2562 2.5582 3.9552 2.0159 6.2398 7.1177 8.2587 7.8421 2.4265 1.9226 10.2173 7.1309 1.4304 1.5306 7.1374 1.4005 2.0408 3.4085 11.2214 7.4341 7.9969 1.2371 2.6518 2.5038 1.3075 1.4635 1.6597 2.3561 1.7322 2.1115 3.8677 11.2145 2.9930 9.7636 3.2592 4.5790 3.4723 4.4519 3.9032 5.2834 4.5766 9.3337 3.7135 4.2033 6.4609 5.4637 1.0869 1.0967 1.0931 1.0930 1.0934 1.0661 1.0756 1.0657
irintensity: 0.0399 1.4018 0.5158 0.3910 0.3304 0.3919 0.4096 8.1546 4.8673 1.9051 45.6598 12.3216 5.6716 3.4522 8.6909 0.7240 1.6613 79.7177 37.6104 29.7034 0.5839 3.5682 25.7577 2.2150 2.3393 4.7450 20.4000 84.4107 42.9120 3.4511 7.2069 4.4063 85.0632 44.3887 14.8725 12.8163 37.0345 34.8080 13.4344 25.2165 0.5906 9.3078 13.4198 1.2132 19.3858 32.8590 15.4892 3.4985 70.2299 85.9545 24.4841 6.0760 12.8134 20.2454 3.4238 56.2304 63.0273 49.0158 87.7585 6.9099 70.7850 18.2315 72.5989 255.9688 9.5929 4.5668 40.8627 51.9134 66.8630 98.7987 184.5004 98.9860 93.3165 11.6394 28.8658 6.0571 70.2708 133.3932 61.3316 43.5846 824.2569 715.2852 295.2971 32.8077 6.4605 14.8789 16.1836 5.4582 19.3292 12.2137 47.7476 45.8260 35.8353
temp: 298.150 k
press: 1.00000 atm
elementType: 17 16 9 9 8 8 8 8 7 7 7 6 6 6 6 6 6 6 6 6 6 6 6 6 6 1 1 1 1 1 1 1 1
symmnumber: 1
zpe: 535890.4 jmol-1
zpe.correction: 0.204110 hartree
zpe.thermalcorrener: 0.226961 hartree
zpe.thermalcorrenthalpy: 0.227905 hartree
zpe.thermalcorrgfe: 0.149965 hartree
zpe.sumelectzpe: -2059.305222 hartree
zpe.sumelectthermal: -2059.282371 hartree
zpe.sumelectthermalent: -2059.281427 hartree
zpe.sumelectthermalfe: -2059.359367 hartree
dipole: 3.0714 8.0807 1.4634
dipole: 8.7677
quadrupole: -195.3080 -149.4506 -160.1292
quadrupole: 11.3755 -10.7774 -6.0529
quadrupole: -27.0121 18.8453 8.1667 11.3755 -10.7774 -6.0529
hfenergy: -2059.509332 hartree
pointgroup: C01 [X(C14H8Cl1F2N3O4S1)]
dipole: 0.9656326 3.2925708 0.3543003 debye
polarizability: 405.2834427|10.9931994|266.9110382|2.4826148|-10.1991711|102.0061474 unknown
InChI: InChI=1S/C14H8ClF2N3O4S/c15-11-12(16)19-14(17)20-13(11)18-7-1-2-9-6(3-7)4-8(5-10(9)21)25(22,23)24/h1-5,18,21-22H
charge 0 multiplicity 1
33 atoms
Cl 5.237249 2.129446 -0.027577
S  -4.809646 -1.896689 0.006686
F  6.713573 -0.544594 0.148731
F  2.976616 -3.275991 0.23983
O  -4.058443 3.219317 -0.239187
O  -4.995834 -1.930265 1.854552
O  -6.241115 -1.522767 -0.64561
O  -4.013965 -3.226066 -0.457885
N  2.263258 1.350557 -0.034444
N  2.606924 -1.009354 0.104006
N  4.850176 -1.929939 0.195055
C  -1.430623 0.488332 -0.048778
C  -1.994727 1.821698 -0.122244
C  -3.667303 -0.412208 -0.031927
C  -2.301399 -0.648672 -0.000472
C  -0.011485 0.306558 -0.018666
C  0.842333 1.416952 -0.059994
C  -3.430065 1.974333 -0.157766
C  -1.090404 2.931827 -0.16371
C  -4.274806 0.860842 -0.108418
C  0.286369 2.740777 -0.133469
C  3.10735 0.26879 0.040831
C  4.532766 0.467802 0.05357
C  5.335703 -0.674652 0.131934
C  3.507359 -1.999569 0.175957
H  -1.900315 -1.66563 0.044752
H  0.405951 -0.699587 0.03809
H  -1.459522 3.964095 -0.216917
H  -5.360249 0.981627 -0.147404
H  0.956357 3.608917 -0.164439
H  2.744205 2.255129 -0.07663
H  -3.412054 3.96546 -0.285968
H  -5.628533 -2.673478 2.079708
